Build Result for tbits.net/TBitsKolab16Test/kolab-webadmin/TBitsKolab16Test

go to bottom of this page
[00:00:00]  * Starting at 2019-01-07 22:06:01 GMT+0100
[00:00:00]  * Preparing the machine...
[00:00:01] now running: ssh -f -o "StrictHostKeyChecking no" -p 2222 -i /etc/lightbuildserver/container/container_rsa root@build04lxc.lbs.solidcharity.com "export LC_ALL=C; (if [ -d /var/lib/lxc/005-build04lxc.lbs.solidcharity.com ]; then lxc-destroy --name 005-build04lxc.lbs.solidcharity.com; fi) 2>&1; echo \$?"
[00:00:02] lxc-destroy: 005-build04lxc.lbs.solidcharity.com: tools/lxc_destroy.c: main: 271 Destroyed container 005-build04lxc.lbs.solidcharity.com
[00:00:02] 0
[00:00:02] now running: ssh -f -o "StrictHostKeyChecking no" -p 2222 -i /etc/lightbuildserver/container/container_rsa root@build04lxc.lbs.solidcharity.com "export LC_ALL=C; (/usr/share/lxc-scripts/initLXC.sh) 2>&1; echo \$?"
[00:00:03] patching file lxc-fedora
[00:00:03] Hunk #1 FAILED at 562.
[00:00:03] Hunk #2 FAILED at 570.
[00:00:03] Hunk #3 FAILED at 647.
[00:00:03] Hunk #4 FAILED at 680.
[00:00:03] Hunk #5 FAILED at 813.
[00:00:03] Hunk #6 succeeded at 1178 (offset -13 lines).
[00:00:03] 5 out of 6 hunks FAILED -- saving rejects to file lxc-fedora.rej
[00:00:03] patching file lxc-fedora
[00:00:03] Hunk #1 FAILED at 687.
[00:00:03] Hunk #2 FAILED at 695.
[00:00:03] Hunk #3 FAILED at 809.
[00:00:03] Hunk #4 FAILED at 1016.
[00:00:03] 4 out of 4 hunks FAILED -- saving rejects to file lxc-fedora.rej
[00:00:04] 0
[00:00:04] now running: ssh -f -o "StrictHostKeyChecking no" -p 2222 -i /etc/lightbuildserver/container/container_rsa root@build04lxc.lbs.solidcharity.com "export LC_ALL=C; (/usr/share/lxc-scripts/initCentOS.sh 005-build04lxc.lbs.solidcharity.com 5 7 amd64 0) 2>&1; echo \$?"
[00:00:04] Using image from local cache
[00:00:04] Unpacking the rootfs
[00:00:12] 
[00:00:14] ---
[00:00:14] You just created a CentOS container (release=7, arch=amd64, variant=default)
[00:00:14] 
[00:00:14] To enable sshd, run: yum install openssh-server
[00:00:14] 
[00:00:14] For security reason, container images ship without user accounts
[00:00:14] and without a root password.
[00:00:14] 
[00:00:14] Use lxc-attach or chroot directly into the rootfs to set a root password
[00:00:14] or create user accounts.
[00:00:14] Host 10.0.3.5 not found in /root/.ssh/known_hosts
[00:00:14] /root
[00:00:14] Loaded plugins: fastestmirror
[00:00:14] Determining fastest mirrors
[00:00:15]  * base: mirror.fra10.de.leaseweb.net
[00:00:15]  * extras: mirror.ratiokontakt.de
[00:00:15]  * updates: mirror.23media.de
[00:00:18] Resolving Dependencies
[00:00:18] --> Running transaction check
[00:00:18] ---> Package openssh-server.x86_64 0:7.4p1-16.el7 will be installed
[00:00:18] --> Finished Dependency Resolution
[00:00:18] 
[00:00:18] Dependencies Resolved
[00:00:18] 
[00:00:18] ================================================================================
[00:00:18]  Package                Arch           Version               Repository    Size
[00:00:18] ================================================================================
[00:00:18] Installing:
[00:00:18]  openssh-server         x86_64         7.4p1-16.el7          base         458 k
[00:00:18] 
[00:00:18] Transaction Summary
[00:00:18] ================================================================================
[00:00:18] Install  1 Package
[00:00:18] 
[00:00:18] Total download size: 458 k
[00:00:18] Installed size: 971 k
[00:00:18] Downloading packages:
[00:00:18] warning: [fd 20]: Header V3 RSA/SHA256 Signature, key ID f4a80eb5: NOKEY
[00:00:18] Public key for openssh-server-7.4p1-16.el7.x86_64.rpm is not installed
[00:00:18] Retrieving key from file:///etc/pki/rpm-gpg/RPM-GPG-KEY-CentOS-7
[00:00:18] Importing GPG key 0xF4A80EB5:
[00:00:18]  Userid     : "CentOS-7 Key (CentOS 7 Official Signing Key) <security@centos.org>"
[00:00:18]  Fingerprint: 6341 ab27 53d7 8a78 a7c2 7bb1 24c6 a8a7 f4a8 0eb5
[00:00:18]  Package    : centos-release-7-6.1810.2.el7.centos.x86_64 (@base)
[00:00:18]  From       : /etc/pki/rpm-gpg/RPM-GPG-KEY-CentOS-7
[00:00:18] Running transaction check
[00:00:18] Running transaction test
[00:00:18] Transaction test succeeded
[00:00:18] Running transaction
[00:00:18]   Installing : openssh-server-7.4p1-16.el7.x86_64                           1/1 
[00:00:18]   Verifying  : openssh-server-7.4p1-16.el7.x86_64                           1/1 
[00:00:18] 
[00:00:18] Installed:
[00:00:18]   openssh-server.x86_64 0:7.4p1-16.el7                                          
[00:00:18] 
[00:00:18] Complete!
[00:00:18] Removing password for user root.
[00:00:18] passwd: Success
[00:00:18] To setup port forwarding from outside, please run:
[00:00:18] ./tunnelport.sh 5 22
[00:00:18] ./initWebproxy.sh 5 www.005-build04lxc.lbs.solidcharity.com.de
[00:00:18] 
[00:00:18] To start the container, run: lxc-start -d -n 005-build04lxc.lbs.solidcharity.com
[00:00:18] 
[00:00:18] To connect to the container locally, run: eval `ssh-agent`; ssh-add; ssh root@10.0.3.5
[00:00:18] 0
[00:00:18] now running: ssh -f -o "StrictHostKeyChecking no" -p 2222 -i /etc/lightbuildserver/container/container_rsa root@build04lxc.lbs.solidcharity.com "export LC_ALL=C; (/usr/share/lxc-scripts/tunnelport.sh 5 22) 2>&1; echo \$?"
[00:00:19] outward interface: ens18
[00:00:19] outward IP address: 80.241.214.124
[00:00:19] bridge interface: lxcbr0
[00:00:19] bridge address: 10.0.3.1
[00:00:19] guestip: 10.0.3.5
[00:00:19] there is already a mapping for port  2005
[00:00:19] 0
[00:00:19] now running: ssh -f -o "StrictHostKeyChecking no" -p 2222 -i /etc/lightbuildserver/container/container_rsa root@build04lxc.lbs.solidcharity.com "export LC_ALL=C; (mkdir -p /var/lib/lxc/005-build04lxc.lbs.solidcharity.com/rootfs/root/.ssh/) 2>&1; echo \$?"
[00:00:19] 0
[00:00:19] now running: echo "put /etc/lightbuildserver/container/container_rsa.pub authorized_keys2" | sftp -o "StrictHostKeyChecking no" -oPort=2222 -i /etc/lightbuildserver/container/container_rsa root@build04lxc.lbs.solidcharity.com:/var/lib/lxc/005-build04lxc.lbs.solidcharity.com/rootfs/root/.ssh/
[00:00:19] Connected to build04lxc.lbs.solidcharity.com.
[00:00:19] Changing to: /var/lib/lxc/005-build04lxc.lbs.solidcharity.com/rootfs/root/.ssh/
[00:00:19] sftp> put /etc/lightbuildserver/container/container_rsa.pub authorized_keys2
[00:00:19] Uploading /etc/lightbuildserver/container/container_rsa.pub to /var/lib/lxc/005-build04lxc.lbs.solidcharity.com/rootfs/root/.ssh/authorized_keys2
[00:00:19] now running: ssh -f -o "StrictHostKeyChecking no" -p 2222 -i /etc/lightbuildserver/container/container_rsa root@build04lxc.lbs.solidcharity.com "export LC_ALL=C; (cd /var/lib/lxc/005-build04lxc.lbs.solidcharity.com/rootfs/root/.ssh/ && cat authorized_keys2 >> authorized_keys && rm authorized_keys2) 2>&1; echo \$?"
[00:00:20] 0
[00:00:20] now running: ssh -f -o "StrictHostKeyChecking no" -p 2222 -i /etc/lightbuildserver/container/container_rsa root@build04lxc.lbs.solidcharity.com "export LC_ALL=C; (chmod 700 /var/lib/lxc/005-build04lxc.lbs.solidcharity.com/rootfs/root/.ssh/ && chmod 600 /var/lib/lxc/005-build04lxc.lbs.solidcharity.com/rootfs/root/.ssh/authorized_keys) 2>&1; echo \$?"
[00:00:20] 0
[00:00:20] now running: ssh -f -o "StrictHostKeyChecking no" -p 2222 -i /etc/lightbuildserver/container/container_rsa root@build04lxc.lbs.solidcharity.com "export LC_ALL=C; (/usr/share/lxc-scripts/initMount.sh /mnt/var/lib/lightbuildserver/repos/tbits.net/TBitsKolab16Test/centos/7 005-build04lxc.lbs.solidcharity.com /root/repo) 2>&1; echo \$?"
[00:00:20] 0
[00:00:20] now running: rsync -avz --delete -e "ssh -i /etc/lightbuildserver/container/container_rsa -p 2222" /var/lib/lightbuildserver/repos/tbits.net/TBitsKolab16Test/centos/7 root@build04lxc.lbs.solidcharity.com:/mnt/var/lib/lightbuildserver/repos/tbits.net/TBitsKolab16Test/centos
[00:00:21] sending incremental file list
[00:00:21] 7/lbs-tbits.net-TBitsKolab16Test.repo
[00:00:21] 7/repodata/
[00:00:21] 
[00:00:21] sent 2,937 bytes  received 89 bytes  6,052.00 bytes/sec
[00:00:21] total size is 39,544,584  speedup is 13,068.27
[00:00:21] now running: ssh -f -o "StrictHostKeyChecking no" -p 2222 -i /etc/lightbuildserver/container/container_rsa root@build04lxc.lbs.solidcharity.com "export LC_ALL=C; (/usr/share/lxc-scripts/initMount.sh /mnt/var/lib/lightbuildserver/tarballs/tbits.net/TBitsKolab16Test 005-build04lxc.lbs.solidcharity.com /root/tarball) 2>&1; echo \$?"
[00:00:21] 0
[00:00:21] now running: rsync -avz --delete -e "ssh -i /etc/lightbuildserver/container/container_rsa -p 2222" /var/lib/lightbuildserver/tarballs/tbits.net/TBitsKolab16Test root@build04lxc.lbs.solidcharity.com:/mnt/var/lib/lightbuildserver/tarballs/tbits.net
[00:00:21] sending incremental file list
[00:00:21] 
[00:00:21] sent 84 bytes  received 17 bytes  202.00 bytes/sec
[00:00:21] total size is 0  speedup is 0.00
[00:00:21] now running: ssh -f -o "StrictHostKeyChecking no" -p 2222 -i /etc/lightbuildserver/container/container_rsa root@build04lxc.lbs.solidcharity.com "export LC_ALL=C; (lxc-start -d -n 005-build04lxc.lbs.solidcharity.com) 2>&1; echo \$?"
[00:00:22] 0
[00:00:22] now running: ssh-keygen -f "/run/uwsgi/.ssh/known_hosts" -R 10.0.3.5
[00:00:22] # Host 10.0.3.5 found: line 7
[00:00:22] /run/uwsgi/.ssh/known_hosts updated.
[00:00:22] Original contents retained as /run/uwsgi/.ssh/known_hosts.old
[00:00:22] now running: ssh -f -o "StrictHostKeyChecking no" -o Port=22 -i /etc/lightbuildserver/container/container_rsa root@10.0.3.5 "export LC_ALL=C; (echo "container is running") 2>&1 && echo \$?"
[00:00:23] Warning: Permanently added '10.0.3.5' (ECDSA) to the list of known hosts.
[00:00:23] container is running
[00:00:23] 0
[00:00:23] container has been started successfully
[00:00:23] now running: ssh -f -o "StrictHostKeyChecking no" -o Port=22 -i /etc/lightbuildserver/container/container_rsa root@10.0.3.5 "export LC_ALL=C; (yum -y install tar createrepo gcc rpm-build rpm-sign gnupg make curl iptables rsync perl iproute yum-utils yum-plugin-priorities) 2>&1 && echo \$?"
[00:00:23] Loaded plugins: fastestmirror
[00:00:23] Loading mirror speeds from cached hostfile
[00:00:23]  * base: mirror.ratiokontakt.de
[00:00:23]  * extras: mirror.fra10.de.leaseweb.net
[00:00:24]  * updates: centos.mirror.net-d-sign.de
[00:00:24] Package 2:tar-1.26-35.el7.x86_64 already installed and latest version
[00:00:24] Package gnupg2-2.0.22-5.el7_5.x86_64 already installed and latest version
[00:00:24] Package curl-7.29.0-51.el7.x86_64 already installed and latest version
[00:00:24] Package iptables-1.4.21-28.el7.x86_64 already installed and latest version
[00:00:24] Package iproute-4.11.0-14.el7.x86_64 already installed and latest version
[00:00:24] Resolving Dependencies
[00:00:24] --> Running transaction check
[00:00:24] ---> Package createrepo.noarch 0:0.9.9-28.el7 will be installed
[00:00:24] --> Processing Dependency: python-deltarpm for package: createrepo-0.9.9-28.el7.noarch
[00:00:24] --> Processing Dependency: libxml2-python for package: createrepo-0.9.9-28.el7.noarch
[00:00:24] --> Processing Dependency: deltarpm for package: createrepo-0.9.9-28.el7.noarch
[00:00:24] ---> Package gcc.x86_64 0:4.8.5-36.el7 will be installed
[00:00:24] --> Processing Dependency: libgomp = 4.8.5-36.el7 for package: gcc-4.8.5-36.el7.x86_64
[00:00:24] --> Processing Dependency: cpp = 4.8.5-36.el7 for package: gcc-4.8.5-36.el7.x86_64
[00:00:24] --> Processing Dependency: glibc-devel >= 2.2.90-12 for package: gcc-4.8.5-36.el7.x86_64
[00:00:24] --> Processing Dependency: libmpfr.so.4()(64bit) for package: gcc-4.8.5-36.el7.x86_64
[00:00:24] --> Processing Dependency: libmpc.so.3()(64bit) for package: gcc-4.8.5-36.el7.x86_64
[00:00:24] --> Processing Dependency: libgomp.so.1()(64bit) for package: gcc-4.8.5-36.el7.x86_64
[00:00:24] ---> Package make.x86_64 1:3.82-23.el7 will be installed
[00:00:24] ---> Package perl.x86_64 4:5.16.3-293.el7 will be installed
[00:00:24] --> Processing Dependency: perl-libs = 4:5.16.3-293.el7 for package: 4:perl-5.16.3-293.el7.x86_64
[00:00:24] --> Processing Dependency: perl(Socket) >= 1.3 for package: 4:perl-5.16.3-293.el7.x86_64
[00:00:24] --> Processing Dependency: perl(Scalar::Util) >= 1.10 for package: 4:perl-5.16.3-293.el7.x86_64
[00:00:24] --> Processing Dependency: perl-macros for package: 4:perl-5.16.3-293.el7.x86_64
[00:00:24] --> Processing Dependency: perl-libs for package: 4:perl-5.16.3-293.el7.x86_64
[00:00:24] --> Processing Dependency: perl(threads::shared) for package: 4:perl-5.16.3-293.el7.x86_64
[00:00:24] --> Processing Dependency: perl(threads) for package: 4:perl-5.16.3-293.el7.x86_64
[00:00:24] --> Processing Dependency: perl(constant) for package: 4:perl-5.16.3-293.el7.x86_64
[00:00:24] --> Processing Dependency: perl(Time::Local) for package: 4:perl-5.16.3-293.el7.x86_64
[00:00:24] --> Processing Dependency: perl(Time::HiRes) for package: 4:perl-5.16.3-293.el7.x86_64
[00:00:24] --> Processing Dependency: perl(Storable) for package: 4:perl-5.16.3-293.el7.x86_64
[00:00:24] --> Processing Dependency: perl(Socket) for package: 4:perl-5.16.3-293.el7.x86_64
[00:00:24] --> Processing Dependency: perl(Scalar::Util) for package: 4:perl-5.16.3-293.el7.x86_64
[00:00:24] --> Processing Dependency: perl(Pod::Simple::XHTML) for package: 4:perl-5.16.3-293.el7.x86_64
[00:00:24] --> Processing Dependency: perl(Pod::Simple::Search) for package: 4:perl-5.16.3-293.el7.x86_64
[00:00:24] --> Processing Dependency: perl(Getopt::Long) for package: 4:perl-5.16.3-293.el7.x86_64
[00:00:24] --> Processing Dependency: perl(Filter::Util::Call) for package: 4:perl-5.16.3-293.el7.x86_64
[00:00:24] --> Processing Dependency: perl(File::Temp) for package: 4:perl-5.16.3-293.el7.x86_64
[00:00:24] --> Processing Dependency: perl(File::Spec::Unix) for package: 4:perl-5.16.3-293.el7.x86_64
[00:00:24] --> Processing Dependency: perl(File::Spec::Functions) for package: 4:perl-5.16.3-293.el7.x86_64
[00:00:24] --> Processing Dependency: perl(File::Spec) for package: 4:perl-5.16.3-293.el7.x86_64
[00:00:24] --> Processing Dependency: perl(File::Path) for package: 4:perl-5.16.3-293.el7.x86_64
[00:00:24] --> Processing Dependency: perl(Exporter) for package: 4:perl-5.16.3-293.el7.x86_64
[00:00:24] --> Processing Dependency: perl(Cwd) for package: 4:perl-5.16.3-293.el7.x86_64
[00:00:24] --> Processing Dependency: perl(Carp) for package: 4:perl-5.16.3-293.el7.x86_64
[00:00:24] --> Processing Dependency: libperl.so()(64bit) for package: 4:perl-5.16.3-293.el7.x86_64
[00:00:24] ---> Package rpm-build.x86_64 0:4.11.3-35.el7 will be installed
[00:00:24] --> Processing Dependency: patch >= 2.5 for package: rpm-build-4.11.3-35.el7.x86_64
[00:00:24] --> Processing Dependency: elfutils >= 0.128 for package: rpm-build-4.11.3-35.el7.x86_64
[00:00:24] --> Processing Dependency: unzip for package: rpm-build-4.11.3-35.el7.x86_64
[00:00:24] --> Processing Dependency: system-rpm-config for package: rpm-build-4.11.3-35.el7.x86_64
[00:00:24] --> Processing Dependency: perl(Thread::Queue) for package: rpm-build-4.11.3-35.el7.x86_64
[00:00:24] --> Processing Dependency: file for package: rpm-build-4.11.3-35.el7.x86_64
[00:00:24] --> Processing Dependency: bzip2 for package: rpm-build-4.11.3-35.el7.x86_64
[00:00:24] --> Processing Dependency: /usr/bin/gdb-add-index for package: rpm-build-4.11.3-35.el7.x86_64
[00:00:24] ---> Package rpm-sign.x86_64 0:4.11.3-35.el7 will be installed
[00:00:24] ---> Package rsync.x86_64 0:3.1.2-4.el7 will be installed
[00:00:24] ---> Package yum-plugin-priorities.noarch 0:1.1.31-50.el7 will be installed
[00:00:24] ---> Package yum-utils.noarch 0:1.1.31-50.el7 will be installed
[00:00:24] --> Processing Dependency: python-kitchen for package: yum-utils-1.1.31-50.el7.noarch
[00:00:24] --> Running transaction check
[00:00:24] ---> Package bzip2.x86_64 0:1.0.6-13.el7 will be installed
[00:00:24] ---> Package cpp.x86_64 0:4.8.5-36.el7 will be installed
[00:00:24] ---> Package deltarpm.x86_64 0:3.6-3.el7 will be installed
[00:00:24] ---> Package elfutils.x86_64 0:0.172-2.el7 will be installed
[00:00:24] ---> Package file.x86_64 0:5.11-35.el7 will be installed
[00:00:24] ---> Package gdb.x86_64 0:7.6.1-114.el7 will be installed
[00:00:24] ---> Package glibc-devel.x86_64 0:2.17-260.el7 will be installed
[00:00:25] --> Processing Dependency: glibc-headers = 2.17-260.el7 for package: glibc-devel-2.17-260.el7.x86_64
[00:00:25] --> Processing Dependency: glibc-headers for package: glibc-devel-2.17-260.el7.x86_64
[00:00:25] ---> Package libgomp.x86_64 0:4.8.5-36.el7 will be installed
[00:00:25] ---> Package libmpc.x86_64 0:1.0.1-3.el7 will be installed
[00:00:25] ---> Package libxml2-python.x86_64 0:2.9.1-6.el7_2.3 will be installed
[00:00:25] ---> Package mpfr.x86_64 0:3.1.1-4.el7 will be installed
[00:00:25] ---> Package patch.x86_64 0:2.7.1-10.el7_5 will be installed
[00:00:25] ---> Package perl-Carp.noarch 0:1.26-244.el7 will be installed
[00:00:25] ---> Package perl-Exporter.noarch 0:5.68-3.el7 will be installed
[00:00:25] ---> Package perl-File-Path.noarch 0:2.09-2.el7 will be installed
[00:00:25] ---> Package perl-File-Temp.noarch 0:0.23.01-3.el7 will be installed
[00:00:25] ---> Package perl-Filter.x86_64 0:1.49-3.el7 will be installed
[00:00:25] ---> Package perl-Getopt-Long.noarch 0:2.40-3.el7 will be installed
[00:00:25] --> Processing Dependency: perl(Pod::Usage) >= 1.14 for package: perl-Getopt-Long-2.40-3.el7.noarch
[00:00:25] --> Processing Dependency: perl(Text::ParseWords) for package: perl-Getopt-Long-2.40-3.el7.noarch
[00:00:25] ---> Package perl-PathTools.x86_64 0:3.40-5.el7 will be installed
[00:00:25] ---> Package perl-Pod-Simple.noarch 1:3.28-4.el7 will be installed
[00:00:25] --> Processing Dependency: perl(Pod::Escapes) >= 1.04 for package: 1:perl-Pod-Simple-3.28-4.el7.noarch
[00:00:25] --> Processing Dependency: perl(Encode) for package: 1:perl-Pod-Simple-3.28-4.el7.noarch
[00:00:25] ---> Package perl-Scalar-List-Utils.x86_64 0:1.27-248.el7 will be installed
[00:00:25] ---> Package perl-Socket.x86_64 0:2.010-4.el7 will be installed
[00:00:25] ---> Package perl-Storable.x86_64 0:2.45-3.el7 will be installed
[00:00:25] ---> Package perl-Thread-Queue.noarch 0:3.02-2.el7 will be installed
[00:00:25] ---> Package perl-Time-HiRes.x86_64 4:1.9725-3.el7 will be installed
[00:00:25] ---> Package perl-Time-Local.noarch 0:1.2300-2.el7 will be installed
[00:00:25] ---> Package perl-constant.noarch 0:1.27-2.el7 will be installed
[00:00:25] ---> Package perl-libs.x86_64 4:5.16.3-293.el7 will be installed
[00:00:25] ---> Package perl-macros.x86_64 4:5.16.3-293.el7 will be installed
[00:00:25] ---> Package perl-threads.x86_64 0:1.87-4.el7 will be installed
[00:00:25] ---> Package perl-threads-shared.x86_64 0:1.43-6.el7 will be installed
[00:00:25] ---> Package python-deltarpm.x86_64 0:3.6-3.el7 will be installed
[00:00:25] ---> Package python-kitchen.noarch 0:1.1.1-5.el7 will be installed
[00:00:25] --> Processing Dependency: python-chardet for package: python-kitchen-1.1.1-5.el7.noarch
[00:00:25] ---> Package redhat-rpm-config.noarch 0:9.1.0-87.el7.centos will be installed
[00:00:25] --> Processing Dependency: dwz >= 0.4 for package: redhat-rpm-config-9.1.0-87.el7.centos.noarch
[00:00:25] --> Processing Dependency: zip for package: redhat-rpm-config-9.1.0-87.el7.centos.noarch
[00:00:25] --> Processing Dependency: perl-srpm-macros for package: redhat-rpm-config-9.1.0-87.el7.centos.noarch
[00:00:25] ---> Package unzip.x86_64 0:6.0-19.el7 will be installed
[00:00:25] --> Running transaction check
[00:00:25] ---> Package dwz.x86_64 0:0.11-3.el7 will be installed
[00:00:25] ---> Package glibc-headers.x86_64 0:2.17-260.el7 will be installed
[00:00:25] --> Processing Dependency: kernel-headers >= 2.2.1 for package: glibc-headers-2.17-260.el7.x86_64
[00:00:25] --> Processing Dependency: kernel-headers for package: glibc-headers-2.17-260.el7.x86_64
[00:00:25] ---> Package perl-Encode.x86_64 0:2.51-7.el7 will be installed
[00:00:25] ---> Package perl-Pod-Escapes.noarch 1:1.04-293.el7 will be installed
[00:00:25] ---> Package perl-Pod-Usage.noarch 0:1.63-3.el7 will be installed
[00:00:25] --> Processing Dependency: perl(Pod::Text) >= 3.15 for package: perl-Pod-Usage-1.63-3.el7.noarch
[00:00:25] --> Processing Dependency: perl-Pod-Perldoc for package: perl-Pod-Usage-1.63-3.el7.noarch
[00:00:25] ---> Package perl-Text-ParseWords.noarch 0:3.29-4.el7 will be installed
[00:00:25] ---> Package perl-srpm-macros.noarch 0:1-8.el7 will be installed
[00:00:25] ---> Package python-chardet.noarch 0:2.2.1-1.el7_1 will be installed
[00:00:25] ---> Package zip.x86_64 0:3.0-11.el7 will be installed
[00:00:25] --> Running transaction check
[00:00:25] ---> Package kernel-headers.x86_64 0:3.10.0-957.1.3.el7 will be installed
[00:00:25] ---> Package perl-Pod-Perldoc.noarch 0:3.20-4.el7 will be installed
[00:00:25] --> Processing Dependency: perl(parent) for package: perl-Pod-Perldoc-3.20-4.el7.noarch
[00:00:25] --> Processing Dependency: perl(HTTP::Tiny) for package: perl-Pod-Perldoc-3.20-4.el7.noarch
[00:00:25] --> Processing Dependency: groff-base for package: perl-Pod-Perldoc-3.20-4.el7.noarch
[00:00:25] ---> Package perl-podlators.noarch 0:2.5.1-3.el7 will be installed
[00:00:25] --> Running transaction check
[00:00:25] ---> Package groff-base.x86_64 0:1.22.2-8.el7 will be installed
[00:00:25] ---> Package perl-HTTP-Tiny.noarch 0:0.033-3.el7 will be installed
[00:00:25] ---> Package perl-parent.noarch 1:0.225-244.el7 will be installed
[00:00:25] --> Finished Dependency Resolution
[00:00:25] 
[00:00:25] Dependencies Resolved
[00:00:25] 
[00:00:25] ================================================================================
[00:00:25]  Package                   Arch      Version                   Repository  Size
[00:00:25] ================================================================================
[00:00:25] Installing:
[00:00:25]  createrepo                noarch    0.9.9-28.el7              base        94 k
[00:00:25]  gcc                       x86_64    4.8.5-36.el7              base        16 M
[00:00:25]  make                      x86_64    1:3.82-23.el7             base       420 k
[00:00:25]  perl                      x86_64    4:5.16.3-293.el7          base       8.0 M
[00:00:25]  rpm-build                 x86_64    4.11.3-35.el7             base       147 k
[00:00:25]  rpm-sign                  x86_64    4.11.3-35.el7             base        48 k
[00:00:25]  rsync                     x86_64    3.1.2-4.el7               base       403 k
[00:00:25]  yum-plugin-priorities     noarch    1.1.31-50.el7             base        29 k
[00:00:25]  yum-utils                 noarch    1.1.31-50.el7             base       121 k
[00:00:25] Installing for dependencies:
[00:00:25]  bzip2                     x86_64    1.0.6-13.el7              base        52 k
[00:00:25]  cpp                       x86_64    4.8.5-36.el7              base       5.9 M
[00:00:25]  deltarpm                  x86_64    3.6-3.el7                 base        82 k
[00:00:25]  dwz                       x86_64    0.11-3.el7                base        99 k
[00:00:25]  elfutils                  x86_64    0.172-2.el7               base       299 k
[00:00:25]  file                      x86_64    5.11-35.el7               base        57 k
[00:00:25]  gdb                       x86_64    7.6.1-114.el7             base       2.4 M
[00:00:25]  glibc-devel               x86_64    2.17-260.el7              base       1.1 M
[00:00:25]  glibc-headers             x86_64    2.17-260.el7              base       683 k
[00:00:25]  groff-base                x86_64    1.22.2-8.el7              base       942 k
[00:00:25]  kernel-headers            x86_64    3.10.0-957.1.3.el7        updates    8.0 M
[00:00:25]  libgomp                   x86_64    4.8.5-36.el7              base       157 k
[00:00:25]  libmpc                    x86_64    1.0.1-3.el7               base        51 k
[00:00:25]  libxml2-python            x86_64    2.9.1-6.el7_2.3           base       247 k
[00:00:25]  mpfr                      x86_64    3.1.1-4.el7               base       203 k
[00:00:25]  patch                     x86_64    2.7.1-10.el7_5            base       110 k
[00:00:25]  perl-Carp                 noarch    1.26-244.el7              base        19 k
[00:00:25]  perl-Encode               x86_64    2.51-7.el7                base       1.5 M
[00:00:25]  perl-Exporter             noarch    5.68-3.el7                base        28 k
[00:00:25]  perl-File-Path            noarch    2.09-2.el7                base        26 k
[00:00:25]  perl-File-Temp            noarch    0.23.01-3.el7             base        56 k
[00:00:25]  perl-Filter               x86_64    1.49-3.el7                base        76 k
[00:00:25]  perl-Getopt-Long          noarch    2.40-3.el7                base        56 k
[00:00:25]  perl-HTTP-Tiny            noarch    0.033-3.el7               base        38 k
[00:00:25]  perl-PathTools            x86_64    3.40-5.el7                base        82 k
[00:00:25]  perl-Pod-Escapes          noarch    1:1.04-293.el7            base        51 k
[00:00:25]  perl-Pod-Perldoc          noarch    3.20-4.el7                base        87 k
[00:00:25]  perl-Pod-Simple           noarch    1:3.28-4.el7              base       216 k
[00:00:25]  perl-Pod-Usage            noarch    1.63-3.el7                base        27 k
[00:00:25]  perl-Scalar-List-Utils    x86_64    1.27-248.el7              base        36 k
[00:00:25]  perl-Socket               x86_64    2.010-4.el7               base        49 k
[00:00:25]  perl-Storable             x86_64    2.45-3.el7                base        77 k
[00:00:25]  perl-Text-ParseWords      noarch    3.29-4.el7                base        14 k
[00:00:25]  perl-Thread-Queue         noarch    3.02-2.el7                base        17 k
[00:00:25]  perl-Time-HiRes           x86_64    4:1.9725-3.el7            base        45 k
[00:00:25]  perl-Time-Local           noarch    1.2300-2.el7              base        24 k
[00:00:25]  perl-constant             noarch    1.27-2.el7                base        19 k
[00:00:25]  perl-libs                 x86_64    4:5.16.3-293.el7          base       688 k
[00:00:25]  perl-macros               x86_64    4:5.16.3-293.el7          base        44 k
[00:00:25]  perl-parent               noarch    1:0.225-244.el7           base        12 k
[00:00:25]  perl-podlators            noarch    2.5.1-3.el7               base       112 k
[00:00:25]  perl-srpm-macros          noarch    1-8.el7                   base       4.6 k
[00:00:25]  perl-threads              x86_64    1.87-4.el7                base        49 k
[00:00:25]  perl-threads-shared       x86_64    1.43-6.el7                base        39 k
[00:00:25]  python-chardet            noarch    2.2.1-1.el7_1             base       227 k
[00:00:25]  python-deltarpm           x86_64    3.6-3.el7                 base        31 k
[00:00:25]  python-kitchen            noarch    1.1.1-5.el7               base       267 k
[00:00:25]  redhat-rpm-config         noarch    9.1.0-87.el7.centos       base        81 k
[00:00:25]  unzip                     x86_64    6.0-19.el7                base       170 k
[00:00:25]  zip                       x86_64    3.0-11.el7                base       260 k
[00:00:25] 
[00:00:25] Transaction Summary
[00:00:25] ================================================================================
[00:00:25] Install  9 Packages (+50 Dependent packages)
[00:00:25] 
[00:00:25] Total size: 50 M
[00:00:25] Installed size: 116 M
[00:00:25] Downloading packages:
[00:00:25] Running transaction check
[00:00:25] Running transaction test
[00:00:25] Transaction test succeeded
[00:00:25] Running transaction
[00:00:25]   Installing : mpfr-3.1.1-4.el7.x86_64                                     1/59 
[00:00:25]   Installing : libmpc-1.0.1-3.el7.x86_64                                   2/59 
[00:00:25]   Installing : deltarpm-3.6-3.el7.x86_64                                   3/59 
[00:00:25]   Installing : libxml2-python-2.9.1-6.el7_2.3.x86_64                       4/59 
[00:00:26]   Installing : python-deltarpm-3.6-3.el7.x86_64                            5/59 
[00:00:26]   Installing : cpp-4.8.5-36.el7.x86_64                                     6/59 
[00:00:27]   Installing : elfutils-0.172-2.el7.x86_64                                 7/59 
[00:00:27]   Installing : patch-2.7.1-10.el7_5.x86_64                                 8/59 
[00:00:27]   Installing : unzip-6.0-19.el7.x86_64                                     9/59 
[00:00:27]   Installing : python-chardet-2.2.1-1.el7_1.noarch                        10/59 
[00:00:27]   Installing : python-kitchen-1.1.1-5.el7.noarch                          11/59 
[00:00:27]   Installing : zip-3.0-11.el7.x86_64                                      12/59 
[00:00:27]   Installing : kernel-headers-3.10.0-957.1.3.el7.x86_64                   13/59 
[00:00:28]   Installing : glibc-headers-2.17-260.el7.x86_64                          14/59 
[00:00:28]   Installing : glibc-devel-2.17-260.el7.x86_64                            15/59 
[00:00:28]   Installing : libgomp-4.8.5-36.el7.x86_64                                16/59 
[00:00:28]   Installing : file-5.11-35.el7.x86_64                                    17/59 
[00:00:28]   Installing : perl-srpm-macros-1-8.el7.noarch                            18/59 
[00:00:28]   Installing : gdb-7.6.1-114.el7.x86_64                                   19/59 
[00:00:28]   Installing : dwz-0.11-3.el7.x86_64                                      20/59 
[00:00:28]   Installing : groff-base-1.22.2-8.el7.x86_64                             21/59 
[00:00:28]   Installing : 1:perl-parent-0.225-244.el7.noarch                         22/59 
[00:00:28]   Installing : perl-HTTP-Tiny-0.033-3.el7.noarch                          23/59 
[00:00:28]   Installing : perl-podlators-2.5.1-3.el7.noarch                          24/59 
[00:00:28]   Installing : perl-Pod-Perldoc-3.20-4.el7.noarch                         25/59 
[00:00:28]   Installing : 1:perl-Pod-Escapes-1.04-293.el7.noarch                     26/59 
[00:00:28]   Installing : perl-Text-ParseWords-3.29-4.el7.noarch                     27/59 
[00:00:29]   Installing : perl-Encode-2.51-7.el7.x86_64                              28/59 
[00:00:29]   Installing : perl-Pod-Usage-1.63-3.el7.noarch                           29/59 
[00:00:29]   Installing : perl-threads-1.87-4.el7.x86_64                             30/59 
[00:00:29]   Installing : 4:perl-Time-HiRes-1.9725-3.el7.x86_64                      31/59 
[00:00:29]   Installing : perl-Exporter-5.68-3.el7.noarch                            32/59 
[00:00:29]   Installing : perl-constant-1.27-2.el7.noarch                            33/59 
[00:00:29]   Installing : perl-Carp-1.26-244.el7.noarch                              34/59 
[00:00:29]   Installing : 4:perl-macros-5.16.3-293.el7.x86_64                        35/59 
[00:00:29]   Installing : perl-Time-Local-1.2300-2.el7.noarch                        36/59 
[00:00:29]   Installing : perl-Socket-2.010-4.el7.x86_64                             37/59 
[00:00:29]   Installing : perl-Storable-2.45-3.el7.x86_64                            38/59 
[00:00:29]   Installing : perl-threads-shared-1.43-6.el7.x86_64                      39/59 
[00:00:29]   Installing : perl-PathTools-3.40-5.el7.x86_64                           40/59 
[00:00:29]   Installing : perl-Scalar-List-Utils-1.27-248.el7.x86_64                 41/59 
[00:00:29]   Installing : 1:perl-Pod-Simple-3.28-4.el7.noarch                        42/59 
[00:00:29]   Installing : perl-File-Temp-0.23.01-3.el7.noarch                        43/59 
[00:00:29]   Installing : perl-File-Path-2.09-2.el7.noarch                           44/59 
[00:00:29]   Installing : perl-Filter-1.49-3.el7.x86_64                              45/59 
[00:00:29]   Installing : 4:perl-libs-5.16.3-293.el7.x86_64                          46/59 
[00:00:30]   Installing : perl-Getopt-Long-2.40-3.el7.noarch                         47/59 
[00:00:31]   Installing : 4:perl-5.16.3-293.el7.x86_64                               48/59 
[00:00:31]   Installing : perl-Thread-Queue-3.02-2.el7.noarch                        49/59 
[00:00:31]   Installing : redhat-rpm-config-9.1.0-87.el7.centos.noarch               50/59 
[00:00:31]   Installing : bzip2-1.0.6-13.el7.x86_64                                  51/59 
[00:00:32]   Installing : rpm-build-4.11.3-35.el7.x86_64                             52/59 
[00:00:32]   Installing : gcc-4.8.5-36.el7.x86_64                                    53/59 
[00:00:32]   Installing : yum-utils-1.1.31-50.el7.noarch                             54/59 
[00:00:32]   Installing : createrepo-0.9.9-28.el7.noarch                             55/59 
[00:00:33]   Installing : rsync-3.1.2-4.el7.x86_64                                   56/59 
[00:00:33]   Installing : 1:make-3.82-23.el7.x86_64                                  57/59 
[00:00:33]   Installing : rpm-sign-4.11.3-35.el7.x86_64                              58/59 
[00:00:33]   Installing : yum-plugin-priorities-1.1.31-50.el7.noarch                 59/59 
[00:00:33]   Verifying  : perl-HTTP-Tiny-0.033-3.el7.noarch                           1/59 
[00:00:33]   Verifying  : rpm-build-4.11.3-35.el7.x86_64                              2/59 
[00:00:33]   Verifying  : perl-threads-shared-1.43-6.el7.x86_64                       3/59 
[00:00:33]   Verifying  : 4:perl-Time-HiRes-1.9725-3.el7.x86_64                       4/59 
[00:00:33]   Verifying  : perl-Pod-Perldoc-3.20-4.el7.noarch                          5/59 
[00:00:33]   Verifying  : perl-threads-1.87-4.el7.x86_64                              6/59 
[00:00:33]   Verifying  : perl-Exporter-5.68-3.el7.noarch                             7/59 
[00:00:33]   Verifying  : perl-constant-1.27-2.el7.noarch                             8/59 
[00:00:33]   Verifying  : perl-PathTools-3.40-5.el7.x86_64                            9/59 
[00:00:33]   Verifying  : perl-Carp-1.26-244.el7.noarch                              10/59 
[00:00:33]   Verifying  : 4:perl-macros-5.16.3-293.el7.x86_64                        11/59 
[00:00:33]   Verifying  : 1:perl-parent-0.225-244.el7.noarch                         12/59 
[00:00:33]   Verifying  : bzip2-1.0.6-13.el7.x86_64                                  13/59 
[00:00:33]   Verifying  : gcc-4.8.5-36.el7.x86_64                                    14/59 
[00:00:33]   Verifying  : yum-plugin-priorities-1.1.31-50.el7.noarch                 15/59 
[00:00:33]   Verifying  : groff-base-1.22.2-8.el7.x86_64                             16/59 
[00:00:33]   Verifying  : perl-Thread-Queue-3.02-2.el7.noarch                        17/59 
[00:00:33]   Verifying  : perl-File-Temp-0.23.01-3.el7.noarch                        18/59 
[00:00:33]   Verifying  : 1:perl-Pod-Simple-3.28-4.el7.noarch                        19/59 
[00:00:33]   Verifying  : dwz-0.11-3.el7.x86_64                                      20/59 
[00:00:33]   Verifying  : perl-Time-Local-1.2300-2.el7.noarch                        21/59 
[00:00:33]   Verifying  : gdb-7.6.1-114.el7.x86_64                                   22/59 
[00:00:33]   Verifying  : 1:perl-Pod-Escapes-1.04-293.el7.noarch                     23/59 
[00:00:33]   Verifying  : perl-Text-ParseWords-3.29-4.el7.noarch                     24/59 
[00:00:33]   Verifying  : redhat-rpm-config-9.1.0-87.el7.centos.noarch               25/59 
[00:00:33]   Verifying  : perl-srpm-macros-1-8.el7.noarch                            26/59 
[00:00:33]   Verifying  : perl-Socket-2.010-4.el7.x86_64                             27/59 
[00:00:33]   Verifying  : rpm-sign-4.11.3-35.el7.x86_64                              28/59 
[00:00:33]   Verifying  : file-5.11-35.el7.x86_64                                    29/59 
[00:00:33]   Verifying  : cpp-4.8.5-36.el7.x86_64                                    30/59 
[00:00:33]   Verifying  : libgomp-4.8.5-36.el7.x86_64                                31/59 
[00:00:33]   Verifying  : perl-podlators-2.5.1-3.el7.noarch                          32/59 
[00:00:33]   Verifying  : libxml2-python-2.9.1-6.el7_2.3.x86_64                      33/59 
[00:00:33]   Verifying  : deltarpm-3.6-3.el7.x86_64                                  34/59 
[00:00:33]   Verifying  : perl-Storable-2.45-3.el7.x86_64                            35/59 
[00:00:33]   Verifying  : createrepo-0.9.9-28.el7.noarch                             36/59 
[00:00:33]   Verifying  : perl-Scalar-List-Utils-1.27-248.el7.x86_64                 37/59 
[00:00:33]   Verifying  : 1:make-3.82-23.el7.x86_64                                  38/59 
[00:00:33]   Verifying  : libmpc-1.0.1-3.el7.x86_64                                  39/59 
[00:00:33]   Verifying  : rsync-3.1.2-4.el7.x86_64                                   40/59 
[00:00:33]   Verifying  : kernel-headers-3.10.0-957.1.3.el7.x86_64                   41/59 
[00:00:33]   Verifying  : perl-Pod-Usage-1.63-3.el7.noarch                           42/59 
[00:00:33]   Verifying  : perl-Encode-2.51-7.el7.x86_64                              43/59 
[00:00:33]   Verifying  : glibc-devel-2.17-260.el7.x86_64                            44/59 
[00:00:33]   Verifying  : yum-utils-1.1.31-50.el7.noarch                             45/59 
[00:00:33]   Verifying  : python-deltarpm-3.6-3.el7.x86_64                           46/59 
[00:00:33]   Verifying  : 4:perl-5.16.3-293.el7.x86_64                               47/59 
[00:00:34]   Verifying  : perl-File-Path-2.09-2.el7.noarch                           48/59 
[00:00:34]   Verifying  : zip-3.0-11.el7.x86_64                                      49/59 
[00:00:34]   Verifying  : mpfr-3.1.1-4.el7.x86_64                                    50/59 
[00:00:34]   Verifying  : glibc-headers-2.17-260.el7.x86_64                          51/59 
[00:00:34]   Verifying  : python-chardet-2.2.1-1.el7_1.noarch                        52/59 
[00:00:34]   Verifying  : perl-Filter-1.49-3.el7.x86_64                              53/59 
[00:00:34]   Verifying  : perl-Getopt-Long-2.40-3.el7.noarch                         54/59 
[00:00:34]   Verifying  : python-kitchen-1.1.1-5.el7.noarch                          55/59 
[00:00:34]   Verifying  : unzip-6.0-19.el7.x86_64                                    56/59 
[00:00:34]   Verifying  : patch-2.7.1-10.el7_5.x86_64                                57/59 
[00:00:34]   Verifying  : 4:perl-libs-5.16.3-293.el7.x86_64                          58/59 
[00:00:34]   Verifying  : elfutils-0.172-2.el7.x86_64                                59/59 
[00:00:34] 
[00:00:34] Installed:
[00:00:34]   createrepo.noarch 0:0.9.9-28.el7 gcc.x86_64 0:4.8.5-36.el7                   
[00:00:34]   make.x86_64 1:3.82-23.el7        perl.x86_64 4:5.16.3-293.el7                
[00:00:34]   rpm-build.x86_64 0:4.11.3-35.el7 rpm-sign.x86_64 0:4.11.3-35.el7             
[00:00:34]   rsync.x86_64 0:3.1.2-4.el7       yum-plugin-priorities.noarch 0:1.1.31-50.el7
[00:00:34]   yum-utils.noarch 0:1.1.31-50.el7
[00:00:34] 
[00:00:34] Dependency Installed:
[00:00:34]   bzip2.x86_64 0:1.0.6-13.el7                                                   
[00:00:34]   cpp.x86_64 0:4.8.5-36.el7                                                     
[00:00:34]   deltarpm.x86_64 0:3.6-3.el7                                                   
[00:00:34]   dwz.x86_64 0:0.11-3.el7                                                       
[00:00:34]   elfutils.x86_64 0:0.172-2.el7                                                 
[00:00:34]   file.x86_64 0:5.11-35.el7                                                     
[00:00:34]   gdb.x86_64 0:7.6.1-114.el7                                                    
[00:00:34]   glibc-devel.x86_64 0:2.17-260.el7                                             
[00:00:34]   glibc-headers.x86_64 0:2.17-260.el7                                           
[00:00:34]   groff-base.x86_64 0:1.22.2-8.el7                                              
[00:00:34]   kernel-headers.x86_64 0:3.10.0-957.1.3.el7                                    
[00:00:34]   libgomp.x86_64 0:4.8.5-36.el7                                                 
[00:00:34]   libmpc.x86_64 0:1.0.1-3.el7                                                   
[00:00:34]   libxml2-python.x86_64 0:2.9.1-6.el7_2.3                                       
[00:00:34]   mpfr.x86_64 0:3.1.1-4.el7                                                     
[00:00:34]   patch.x86_64 0:2.7.1-10.el7_5                                                 
[00:00:34]   perl-Carp.noarch 0:1.26-244.el7                                               
[00:00:34]   perl-Encode.x86_64 0:2.51-7.el7                                               
[00:00:34]   perl-Exporter.noarch 0:5.68-3.el7                                             
[00:00:34]   perl-File-Path.noarch 0:2.09-2.el7                                            
[00:00:34]   perl-File-Temp.noarch 0:0.23.01-3.el7                                         
[00:00:34]   perl-Filter.x86_64 0:1.49-3.el7                                               
[00:00:34]   perl-Getopt-Long.noarch 0:2.40-3.el7                                          
[00:00:34]   perl-HTTP-Tiny.noarch 0:0.033-3.el7                                           
[00:00:34]   perl-PathTools.x86_64 0:3.40-5.el7                                            
[00:00:34]   perl-Pod-Escapes.noarch 1:1.04-293.el7                                        
[00:00:34]   perl-Pod-Perldoc.noarch 0:3.20-4.el7                                          
[00:00:34]   perl-Pod-Simple.noarch 1:3.28-4.el7                                           
[00:00:34]   perl-Pod-Usage.noarch 0:1.63-3.el7                                            
[00:00:34]   perl-Scalar-List-Utils.x86_64 0:1.27-248.el7                                  
[00:00:34]   perl-Socket.x86_64 0:2.010-4.el7                                              
[00:00:34]   perl-Storable.x86_64 0:2.45-3.el7                                             
[00:00:34]   perl-Text-ParseWords.noarch 0:3.29-4.el7                                      
[00:00:34]   perl-Thread-Queue.noarch 0:3.02-2.el7                                         
[00:00:34]   perl-Time-HiRes.x86_64 4:1.9725-3.el7                                         
[00:00:34]   perl-Time-Local.noarch 0:1.2300-2.el7                                         
[00:00:34]   perl-constant.noarch 0:1.27-2.el7                                             
[00:00:34]   perl-libs.x86_64 4:5.16.3-293.el7                                             
[00:00:34]   perl-macros.x86_64 4:5.16.3-293.el7                                           
[00:00:34]   perl-parent.noarch 1:0.225-244.el7                                            
[00:00:34]   perl-podlators.noarch 0:2.5.1-3.el7                                           
[00:00:34]   perl-srpm-macros.noarch 0:1-8.el7                                             
[00:00:34]   perl-threads.x86_64 0:1.87-4.el7                                              
[00:00:34]   perl-threads-shared.x86_64 0:1.43-6.el7                                       
[00:00:34]   python-chardet.noarch 0:2.2.1-1.el7_1                                         
[00:00:34]   python-deltarpm.x86_64 0:3.6-3.el7                                            
[00:00:34]   python-kitchen.noarch 0:1.1.1-5.el7                                           
[00:00:34]   redhat-rpm-config.noarch 0:9.1.0-87.el7.centos                                
[00:00:34]   unzip.x86_64 0:6.0-19.el7                                                     
[00:00:34]   zip.x86_64 0:3.0-11.el7                                                       
[00:00:34] 
[00:00:34] Complete!
[00:00:34] 0
[00:00:34] now running: ssh -f -o "StrictHostKeyChecking no" -o Port=22 -i /etc/lightbuildserver/container/container_rsa root@10.0.3.5 "export LC_ALL=C; (if [ -f /etc/yum.repos.d/CentOS-Sources.repo ]; then rm -Rf /etc/yum.repos.d/CentOS-Sources.repo; fi) 2>&1 && echo \$?"
[00:00:34] 0
[00:00:34] now running: ssh -f -o "StrictHostKeyChecking no" -o Port=22 -i /etc/lightbuildserver/container/container_rsa root@10.0.3.5 "export LC_ALL=C; (if [ -f /etc/yum.repos.d/CentOS-Vault.repo ]; then rm -Rf /etc/yum.repos.d/CentOS-Vault.repo; fi) 2>&1 && echo \$?"
[00:00:35] 0
[00:00:35] now running: ssh -f -o "StrictHostKeyChecking no" -o Port=22 -i /etc/lightbuildserver/container/container_rsa root@10.0.3.5 "export LC_ALL=C; (mkdir -p rpmbuild/{BUILD,RPMS,SOURCES,SPECS,SRPMS}) 2>&1 && echo \$?"
[00:00:35] 0
[00:00:35] now running: rsync -avz --delete -e "ssh -i /etc/lightbuildserver/container/container_rsa -p 2222" /var/lib/lightbuildserver/src/tbits.net/lbs-TBitsKolab16Test root@build04lxc.lbs.solidcharity.com:/var/lib/lxc/005-build04lxc.lbs.solidcharity.com/rootfs/root
[00:00:35] sending incremental file list
[00:00:35] lbs-TBitsKolab16Test/
[00:00:35] lbs-TBitsKolab16Test/Readme.md
[00:00:35] lbs-TBitsKolab16Test/config.yml
[00:00:35] lbs-TBitsKolab16Test/chwala/
[00:00:35] lbs-TBitsKolab16Test/chwala/chwala-0.2-suhosin.session.encrypt-php_flag.patch
[00:00:35] lbs-TBitsKolab16Test/chwala/chwala-0.5.2.tar.gz
[00:00:35] lbs-TBitsKolab16Test/chwala/chwala.logrotate
[00:00:35] lbs-TBitsKolab16Test/chwala/chwala.spec
[00:00:35] lbs-TBitsKolab16Test/chwala/fix-autoload-path-debian.patch
[00:00:35] lbs-TBitsKolab16Test/cyrus-imapd/
[00:00:35] lbs-TBitsKolab16Test/cyrus-imapd/0001-dlist-Use-int8_t-in-dlist_parsemap.patch
[00:00:35] lbs-TBitsKolab16Test/cyrus-imapd/0002-Avoid-returning-1-as-255.patch
[00:00:35] lbs-TBitsKolab16Test/cyrus-imapd/cyr_systemd_helper
[00:00:35] lbs-TBitsKolab16Test/cyrus-imapd/cyrus-imapd-2.5.11-41-gd53406f3f.tar.gz
[00:00:36] lbs-TBitsKolab16Test/cyrus-imapd/cyrus-imapd.cron-daily
[00:00:36] lbs-TBitsKolab16Test/cyrus-imapd/cyrus-imapd.cvt_cyrusdb_all
[00:00:36] lbs-TBitsKolab16Test/cyrus-imapd/cyrus-imapd.imap-2.3.x-conf
[00:00:36] lbs-TBitsKolab16Test/cyrus-imapd/cyrus-imapd.init
[00:00:36] lbs-TBitsKolab16Test/cyrus-imapd/cyrus-imapd.logrotate
[00:00:36] lbs-TBitsKolab16Test/cyrus-imapd/cyrus-imapd.magic
[00:00:36] lbs-TBitsKolab16Test/cyrus-imapd/cyrus-imapd.pam-config
[00:00:36] lbs-TBitsKolab16Test/cyrus-imapd/cyrus-imapd.service
[00:00:36] lbs-TBitsKolab16Test/cyrus-imapd/cyrus-imapd.spec
[00:00:36] lbs-TBitsKolab16Test/cyrus-imapd/cyrus-imapd.sysconfig
[00:00:36] lbs-TBitsKolab16Test/cyrus-imapd/cyrus-imapd.upstream
[00:00:36] lbs-TBitsKolab16Test/cyrus-imapd/cyrus_canonification_multiple_domains.patch
[00:00:36] lbs-TBitsKolab16Test/cyrus-imapd/cyrus_filter_kolab_mailboxes.patch
[00:00:36] lbs-TBitsKolab16Test/iRony/
[00:00:36] lbs-TBitsKolab16Test/iRony/add-sabre21-path-for-debian.patch
[00:00:36] lbs-TBitsKolab16Test/iRony/iRony-0.4.1.tar.gz
[00:00:36] lbs-TBitsKolab16Test/iRony/iRony.conf
[00:00:36] lbs-TBitsKolab16Test/iRony/iRony.logrotate
[00:00:36] lbs-TBitsKolab16Test/iRony/iRony.spec
[00:00:36] lbs-TBitsKolab16Test/kolab-autoconf/
[00:00:36] lbs-TBitsKolab16Test/kolab-autoconf/kolab-autoconf-1.3.tar.gz
[00:00:36] lbs-TBitsKolab16Test/kolab-autoconf/kolab-autoconf.spec
[00:00:36] lbs-TBitsKolab16Test/kolab-autoconf/kolab-autoconf.upstream
[00:00:36] lbs-TBitsKolab16Test/kolab-freebusy/
[00:00:36] lbs-TBitsKolab16Test/kolab-freebusy/kolab-freebusy-1.1.0.tar.gz
[00:00:36] lbs-TBitsKolab16Test/kolab-freebusy/kolab-freebusy.conf
[00:00:36] lbs-TBitsKolab16Test/kolab-freebusy/kolab-freebusy.logrotate
[00:00:36] lbs-TBitsKolab16Test/kolab-freebusy/kolab-freebusy.spec
[00:00:36] lbs-TBitsKolab16Test/kolab-freebusy/kolab-freebusy.upstream
[00:00:36] lbs-TBitsKolab16Test/kolab-schema/
[00:00:36] lbs-TBitsKolab16Test/kolab-schema/kolab-schema-3.3.tar.gz
[00:00:36] lbs-TBitsKolab16Test/kolab-schema/kolab-schema.spec
[00:00:36] lbs-TBitsKolab16Test/kolab-syncroton/
[00:00:36] lbs-TBitsKolab16Test/kolab-syncroton/kolab-syncroton-2.3.12.tar.gz
[00:00:36] lbs-TBitsKolab16Test/kolab-syncroton/kolab-syncroton.logrotate
[00:00:36] lbs-TBitsKolab16Test/kolab-syncroton/kolab-syncroton.spec
[00:00:36] lbs-TBitsKolab16Test/kolab-utils/
[00:00:36] lbs-TBitsKolab16Test/kolab-utils/0002-no-tests-for-fbdaemon.patch
[00:00:36] lbs-TBitsKolab16Test/kolab-utils/kolab-utils-3.1.4.tar.gz
[00:00:36] lbs-TBitsKolab16Test/kolab-utils/kolab-utils.spec
[00:00:36] lbs-TBitsKolab16Test/kolab-webadmin/
[00:00:36] lbs-TBitsKolab16Test/kolab-webadmin/99tbits.ldif
[00:00:36] lbs-TBitsKolab16Test/kolab-webadmin/canonification_via_uid_wap.patch
[00:00:36] lbs-TBitsKolab16Test/kolab-webadmin/domainAdminDefaultQuota.patch
[00:00:36] lbs-TBitsKolab16Test/kolab-webadmin/domainAdminMaxAccounts.patch
[00:00:36] lbs-TBitsKolab16Test/kolab-webadmin/domainquotaBug2046.patch
[00:00:36] lbs-TBitsKolab16Test/kolab-webadmin/dont_generate_attribs_when_editing.patch
[00:00:36] lbs-TBitsKolab16Test/kolab-webadmin/initTBitsUserTypes.php
[00:00:36] lbs-TBitsKolab16Test/kolab-webadmin/intranetToken-wap.patch
[00:00:36] lbs-TBitsKolab16Test/kolab-webadmin/kolab-webadmin-3.2.12.tar.gz
[00:00:36] lbs-TBitsKolab16Test/kolab-webadmin/kolab-webadmin.spec
[00:00:36] lbs-TBitsKolab16Test/kolab-webadmin/kolab-webadmin.upstream
[00:00:36] lbs-TBitsKolab16Test/kolab-webadmin/lastLoginTBitsAttribute-wap.patch
[00:00:36] lbs-TBitsKolab16Test/kolab-webadmin/listUsersLastLoginQuotaUsage.patch
[00:00:36] lbs-TBitsKolab16Test/kolab-webadmin/patchMultiDomainAdminsBug2018.patch
[00:00:36] lbs-TBitsKolab16Test/kolab-webadmin/quotaused_wap.patch
[00:00:36] lbs-TBitsKolab16Test/kolab-webadmin/validateAliasDomainPostfixVirtualFileBug2658.patch
[00:00:36] lbs-TBitsKolab16Test/kolab-webadmin/wap_api_listuserswithhash.patch
[00:00:36] lbs-TBitsKolab16Test/kolab-webadmin/wap_disallow_users.patch
[00:00:36] lbs-TBitsKolab16Test/kolab/
[00:00:36] lbs-TBitsKolab16Test/kolab/README
[00:00:36] lbs-TBitsKolab16Test/kolab/kolab-16.0.1.tar.gz
[00:00:36] lbs-TBitsKolab16Test/kolab/kolab.spec
[00:00:36] lbs-TBitsKolab16Test/kolab/kolab.upstream
[00:00:36] lbs-TBitsKolab16Test/libcalendaring/
[00:00:36] lbs-TBitsKolab16Test/libcalendaring/0001-Correct-shebangs.patch
[00:00:36] lbs-TBitsKolab16Test/libcalendaring/ical3-support.patch
[00:00:36] lbs-TBitsKolab16Test/libcalendaring/libcalendaring-4.9.2.tar.gz
[00:00:36] lbs-TBitsKolab16Test/libcalendaring/libcalendaring.spec
[00:00:36] lbs-TBitsKolab16Test/libkolab/
[00:00:36] lbs-TBitsKolab16Test/libkolab/libkolab-0.4.2-cmake-2.8.11.patch
[00:00:36] lbs-TBitsKolab16Test/libkolab/libkolab-0.5-swigutils.cmake.patch
[00:00:36] lbs-TBitsKolab16Test/libkolab/libkolab-2.0.tar.gz
[00:00:36] lbs-TBitsKolab16Test/libkolab/libkolab.spec
[00:00:36] lbs-TBitsKolab16Test/libkolabxml/
[00:00:36] lbs-TBitsKolab16Test/libkolabxml/fix-qverify-argument.patch
[00:00:36] lbs-TBitsKolab16Test/libkolabxml/libkolabxml-1.2.tar.gz
[00:00:36] lbs-TBitsKolab16Test/libkolabxml/libkolabxml.spec
[00:00:36] lbs-TBitsKolab16Test/libkolabxml/libossp-uuid-include.patch
[00:00:36] lbs-TBitsKolab16Test/mozldap/
[00:00:36] lbs-TBitsKolab16Test/mozldap/debian-aggregate.patch
[00:00:36] lbs-TBitsKolab16Test/mozldap/mozldap-6.0.7.tar.gz
[00:00:36] lbs-TBitsKolab16Test/mozldap/mozldap.spec
[00:00:36] lbs-TBitsKolab16Test/php-christianriesen-base32/
[00:00:36] lbs-TBitsKolab16Test/php-christianriesen-base32/christianriesen-base32-1.2.1.tar.gz
[00:00:36] lbs-TBitsKolab16Test/php-christianriesen-base32/php-christianriesen-base32.spec
[00:00:36] lbs-TBitsKolab16Test/php-endroid-qrcode/
[00:00:36] lbs-TBitsKolab16Test/php-endroid-qrcode/endroid-qrcode-1.5.4.tar.gz
[00:00:36] lbs-TBitsKolab16Test/php-endroid-qrcode/php-endroid-qrcode.spec
[00:00:36] lbs-TBitsKolab16Test/php-enygma-yubikey/
[00:00:36] lbs-TBitsKolab16Test/php-enygma-yubikey/enygma-yubikey-3.2.tar.gz
[00:00:36] lbs-TBitsKolab16Test/php-enygma-yubikey/php-enygma-yubikey.spec
[00:00:36] lbs-TBitsKolab16Test/php-sabre-dav/
[00:00:36] lbs-TBitsKolab16Test/php-sabre-dav/0001-Use-homemade-autoload.php.patch
[00:00:36] lbs-TBitsKolab16Test/php-sabre-dav/0002-Drop-Composer-autoLoader-calls.patch
[00:00:36] lbs-TBitsKolab16Test/php-sabre-dav/0003-Increase-timeout.patch
[00:00:37] lbs-TBitsKolab16Test/php-sabre-dav/0004-Install-sabredav.php-in-usr-share-php-sabre21-Sabre.patch
[00:00:37] lbs-TBitsKolab16Test/php-sabre-dav/0005-tfix-threshold.patch
[00:00:37] lbs-TBitsKolab16Test/php-sabre-dav/0006-tfix-selection.patch
[00:00:37] lbs-TBitsKolab16Test/php-sabre-dav/0007-Rename-naturalselection-as-naturalselection21.patch
[00:00:37] lbs-TBitsKolab16Test/php-sabre-dav/0008-Fix-upper-limit-after-spurious-upload-of-php-sabre-e.patch
[00:00:37] lbs-TBitsKolab16Test/php-sabre-dav/0009-naturalselection.1-wfix.patch
[00:00:37] lbs-TBitsKolab16Test/php-sabre-dav/autoload.php
[00:00:37] lbs-TBitsKolab16Test/php-sabre-dav/php-sabre-dav.spec
[00:00:37] lbs-TBitsKolab16Test/php-sabre-dav/sabre-dav-2.1.11.tar.gz
[00:00:37] lbs-TBitsKolab16Test/php-sabre-event/
[00:00:37] lbs-TBitsKolab16Test/php-sabre-event/php-sabre-event.spec
[00:00:37] lbs-TBitsKolab16Test/php-sabre-event/sabre-event-2.0.2.tar.gz
[00:00:37] lbs-TBitsKolab16Test/php-sabre-http/
[00:00:37] lbs-TBitsKolab16Test/php-sabre-http/0001-Use-homemade-autoload.php.patch
[00:00:37] lbs-TBitsKolab16Test/php-sabre-http/0002-Fix-upper-limit-after-spurious-upload-of-php-sabre-e.patch
[00:00:37] lbs-TBitsKolab16Test/php-sabre-http/php-sabre-http.spec
[00:00:37] lbs-TBitsKolab16Test/php-sabre-http/sabre-http-3.0.5.tar.gz
[00:00:37] lbs-TBitsKolab16Test/php-sabre-vobject/
[00:00:37] lbs-TBitsKolab16Test/php-sabre-vobject/0001-Use-homemade-autoloader.php.patch
[00:00:37] lbs-TBitsKolab16Test/php-sabre-vobject/0002-replace-with-homemade-tests-autoloader.patch
[00:00:37] lbs-TBitsKolab16Test/php-sabre-vobject/Canada-East-Saskatchewan-removed-in-2017.3.patch
[00:00:37] lbs-TBitsKolab16Test/php-sabre-vobject/T41247.patch
[00:00:37] lbs-TBitsKolab16Test/php-sabre-vobject/php-sabre-vobject.spec
[00:00:37] lbs-TBitsKolab16Test/php-sabre-vobject/sabre-vobject-3.5.3.tar.gz
[00:00:37] lbs-TBitsKolab16Test/php-sabre-vobject/sabre-vobject-bin.patch
[00:00:37] lbs-TBitsKolab16Test/php-spomky-labs-otphp/
[00:00:37] lbs-TBitsKolab16Test/php-spomky-labs-otphp/php-spomky-labs-otphp.spec
[00:00:37] lbs-TBitsKolab16Test/php-spomky-labs-otphp/spomky-labs-otphp-4.0.2.tar.gz
[00:00:37] lbs-TBitsKolab16Test/pykolab/
[00:00:37] lbs-TBitsKolab16Test/pykolab/allowPrimaryEmailAddressFromDomain.patch
[00:00:37] lbs-TBitsKolab16Test/pykolab/canonification_via_uid_pykolab.patch
[00:00:37] lbs-TBitsKolab16Test/pykolab/cyrus-imapd.conf-cert-paths.patch
[00:00:37] lbs-TBitsKolab16Test/pykolab/disableSpamFilter.patch
[00:00:37] lbs-TBitsKolab16Test/pykolab/disableSpamFilter2.patch
[00:00:37] lbs-TBitsKolab16Test/pykolab/fixPykolabIMAPKeepAlive.patch
[00:00:37] lbs-TBitsKolab16Test/pykolab/kolab_lam_invalid_mailbox_name.patch
[00:00:37] lbs-TBitsKolab16Test/pykolab/lastLoginTBitsAttribute-pykolab.patch
[00:00:37] lbs-TBitsKolab16Test/pykolab/logLoginData.patch
[00:00:37] lbs-TBitsKolab16Test/pykolab/onlyAllowKolabUsersToAuthViaSasl.patch
[00:00:37] lbs-TBitsKolab16Test/pykolab/pykolab-0.8-patch-out-manticore.patch
[00:00:37] lbs-TBitsKolab16Test/pykolab/pykolab-0.8.9.tar.gz
[00:00:37] lbs-TBitsKolab16Test/pykolab/pykolab.logrotate
[00:00:37] lbs-TBitsKolab16Test/pykolab/pykolab.spec
[00:00:37] lbs-TBitsKolab16Test/pykolab/pykolab.upstream
[00:00:37] lbs-TBitsKolab16Test/pykolab/pykolab_do_not_rename_existing_mailbox_T3315.patch
[00:00:37] lbs-TBitsKolab16Test/pykolab/pykolab_no_guam.patch
[00:00:37] lbs-TBitsKolab16Test/pykolab/pykolab_wap_client_unverified_context_localhost.patch
[00:00:37] lbs-TBitsKolab16Test/python-icalendar/
[00:00:37] lbs-TBitsKolab16Test/python-icalendar/icalendar-3.8.2.tar.gz
[00:00:37] lbs-TBitsKolab16Test/python-icalendar/python-icalendar.spec
[00:00:37] lbs-TBitsKolab16Test/python-sievelib/
[00:00:37] lbs-TBitsKolab16Test/python-sievelib/python-sievelib.spec
[00:00:37] lbs-TBitsKolab16Test/python-sievelib/sievelib-0.5.2.tar.gz
[00:00:37] lbs-TBitsKolab16Test/roundcubemail-plugin-contextmenu/
[00:00:37] lbs-TBitsKolab16Test/roundcubemail-plugin-contextmenu/README
[00:00:37] lbs-TBitsKolab16Test/roundcubemail-plugin-contextmenu/roundcubemail-plugin-contextmenu-2.3.tar.gz
[00:00:37] lbs-TBitsKolab16Test/roundcubemail-plugin-contextmenu/roundcubemail-plugin-contextmenu.spec
[00:00:37] lbs-TBitsKolab16Test/roundcubemail-plugin-ude_login/
[00:00:37] lbs-TBitsKolab16Test/roundcubemail-plugin-ude_login/comm.py
[00:00:37] lbs-TBitsKolab16Test/roundcubemail-plugin-ude_login/roundcubemail-plugin-ude_login-4.0.0.tar.gz
[00:00:37] lbs-TBitsKolab16Test/roundcubemail-plugin-ude_login/roundcubemail-plugin-ude_login.spec
[00:00:37] lbs-TBitsKolab16Test/roundcubemail-plugins-kolab/
[00:00:37] lbs-TBitsKolab16Test/roundcubemail-plugins-kolab/0001-Fix-missing-first-occurrence-of-an-event-when-moved-.patch
[00:00:37] lbs-TBitsKolab16Test/roundcubemail-plugins-kolab/canonification_via_uid_roundcube.patch
[00:00:37] lbs-TBitsKolab16Test/roundcubemail-plugins-kolab/comm.py
[00:00:37] lbs-TBitsKolab16Test/roundcubemail-plugins-kolab/plesk.calendar.inc.php
[00:00:37] lbs-TBitsKolab16Test/roundcubemail-plugins-kolab/plesk.kolab_addressbook.inc.php
[00:00:37] lbs-TBitsKolab16Test/roundcubemail-plugins-kolab/plesk.kolab_folders.inc.php
[00:00:37] lbs-TBitsKolab16Test/roundcubemail-plugins-kolab/plesk.libkolab.inc.php
[00:00:37] lbs-TBitsKolab16Test/roundcubemail-plugins-kolab/roundcubeStorageMariadbBug4883.patch
[00:00:37] lbs-TBitsKolab16Test/roundcubemail-plugins-kolab/roundcube_calendar_etc_timezone_T2666.patch
[00:00:37] lbs-TBitsKolab16Test/roundcubemail-plugins-kolab/roundcubemail-plugins-kolab-3.3-kolab-files-manticore-api.patch
[00:00:37] lbs-TBitsKolab16Test/roundcubemail-plugins-kolab/roundcubemail-plugins-kolab-3.3.6.tar.gz
[00:00:37] lbs-TBitsKolab16Test/roundcubemail-plugins-kolab/roundcubemail-plugins-kolab.spec
[00:00:37] lbs-TBitsKolab16Test/roundcubemail-plugins-kolab/roundcubemail-plugins-kolab.upstream
[00:00:37] lbs-TBitsKolab16Test/roundcubemail-skin-chameleon/
[00:00:37] lbs-TBitsKolab16Test/roundcubemail-skin-chameleon/roundcubemail-skin-chameleon-0.3.9.tar.gz
[00:00:37] lbs-TBitsKolab16Test/roundcubemail-skin-chameleon/roundcubemail-skin-chameleon.spec
[00:00:37] lbs-TBitsKolab16Test/roundcubemail/
[00:00:37] lbs-TBitsKolab16Test/roundcubemail/0002-Parse-all-quotas-from-GETQUOTAROOT-6280.patch
[00:00:37] lbs-TBitsKolab16Test/roundcubemail/0003-Update-changelog.patch
[00:00:37] lbs-TBitsKolab16Test/roundcubemail/0004-Fix-bug-where-some-escape-sequences-in-html-styles-c.patch
[00:00:37] lbs-TBitsKolab16Test/roundcubemail/0005-Fix-bug-where-some-forbidden-characters-on-Cyrus-IMA.patch
[00:00:37] lbs-TBitsKolab16Test/roundcubemail/2017111400.sql
[00:00:38] lbs-TBitsKolab16Test/roundcubemail/backport_managesieve_forwards.patch
[00:00:38] lbs-TBitsKolab16Test/roundcubemail/comm.py
[00:00:38] lbs-TBitsKolab16Test/roundcubemail/default-configuration.patch
[00:00:38] lbs-TBitsKolab16Test/roundcubemail/optional_disable_addressbook_export.patch
[00:00:38] lbs-TBitsKolab16Test/roundcubemail/plesk.config.inc.php
[00:00:38] lbs-TBitsKolab16Test/roundcubemail/plesk.managesieve.inc.php
[00:00:38] lbs-TBitsKolab16Test/roundcubemail/plesk.password.inc.php
[00:00:38] lbs-TBitsKolab16Test/roundcubemail/roundcubemail-1.3.6-plugin-enigma-homedir.patch
[00:00:38] lbs-TBitsKolab16Test/roundcubemail/roundcubemail-1.3.6.tar.gz
[00:00:38] lbs-TBitsKolab16Test/roundcubemail/roundcubemail-1.3.8.tar.gz
[00:00:38] lbs-TBitsKolab16Test/roundcubemail/roundcubemail.conf
[00:00:38] lbs-TBitsKolab16Test/roundcubemail/roundcubemail.logrotate
[00:00:38] lbs-TBitsKolab16Test/roundcubemail/roundcubemail.spec
[00:00:38] lbs-TBitsKolab16Test/roundcubemail/roundcubemail.upstream
[00:00:38] lbs-TBitsKolab16Test/roundcubemail/roundcubemail_messages.patch
[00:00:38] lbs-TBitsKolab16Test/updatePackages/
[00:00:38] lbs-TBitsKolab16Test/updatePackages/backport_managesieve_forwards.patch
[00:00:38] lbs-TBitsKolab16Test/updatePackages/comm.py
[00:00:38] lbs-TBitsKolab16Test/updatePackages/cyrus-imapd.patch
[00:00:38] lbs-TBitsKolab16Test/updatePackages/kolab-autoconf.patch
[00:00:38] lbs-TBitsKolab16Test/updatePackages/kolab-freebusy.patch
[00:00:38] lbs-TBitsKolab16Test/updatePackages/kolab-webadmin.patch
[00:00:38] lbs-TBitsKolab16Test/updatePackages/kolab.patch
[00:00:38] lbs-TBitsKolab16Test/updatePackages/pykolab.patch
[00:00:38] lbs-TBitsKolab16Test/updatePackages/pykolab_no_guam.patch
[00:00:38] lbs-TBitsKolab16Test/updatePackages/roundcubemail-1.3.8.tar.gz
[00:00:39] lbs-TBitsKolab16Test/updatePackages/roundcubemail-plugins-kolab.patch
[00:00:39] lbs-TBitsKolab16Test/updatePackages/roundcubemail.patch
[00:00:39] lbs-TBitsKolab16Test/updatePackages/roundcubemail_messages.patch
[00:00:39] lbs-TBitsKolab16Test/updatePackages/setup.sh
[00:00:39] 
[00:00:39] sent 56,489,780 bytes  received 3,912 bytes  12,554,153.78 bytes/sec
[00:00:39] total size is 57,609,851  speedup is 1.02
[00:00:39] now running: ssh -f -o "StrictHostKeyChecking no" -o Port=22 -i /etc/lightbuildserver/container/container_rsa root@10.0.3.5 "export LC_ALL=C; (if [ ! -f /etc/yum.repos.d/epel-release.repo ]; then exit -1; fi) 2>&1 && echo \$?"
[00:00:39] now running: ssh -f -o "StrictHostKeyChecking no" -o Port=22 -i /etc/lightbuildserver/container/container_rsa root@10.0.3.5 "export LC_ALL=C; (yum -y install epel-release) 2>&1 && echo \$?"
[00:00:39] Loaded plugins: fastestmirror, priorities
[00:00:39] Loading mirror speeds from cached hostfile
[00:00:39]  * base: mirror.ratiokontakt.de
[00:00:39]  * extras: mirror.fra10.de.leaseweb.net
[00:00:39]  * updates: centos.mirror.net-d-sign.de
[00:00:39] Resolving Dependencies
[00:00:39] --> Running transaction check
[00:00:39] ---> Package epel-release.noarch 0:7-11 will be installed
[00:00:40] --> Finished Dependency Resolution
[00:00:40] 
[00:00:40] Dependencies Resolved
[00:00:40] 
[00:00:40] ================================================================================
[00:00:40]  Package                Arch             Version         Repository        Size
[00:00:40] ================================================================================
[00:00:40] Installing:
[00:00:40]  epel-release           noarch           7-11            extras            15 k
[00:00:40] 
[00:00:40] Transaction Summary
[00:00:40] ================================================================================
[00:00:40] Install  1 Package
[00:00:40] 
[00:00:40] Total size: 15 k
[00:00:40] Installed size: 24 k
[00:00:40] Downloading packages:
[00:00:40] Running transaction check
[00:00:40] Running transaction test
[00:00:40] Transaction test succeeded
[00:00:40] Running transaction
[00:00:40]   Installing : epel-release-7-11.noarch                                     1/1 
[00:00:40]   Verifying  : epel-release-7-11.noarch                                     1/1 
[00:00:40] 
[00:00:40] Installed:
[00:00:40]   epel-release.noarch 0:7-11                                                    
[00:00:40] 
[00:00:40] Complete!
[00:00:40] 0
[00:00:40] now running: rsync -avz --delete -e "ssh -i /etc/lightbuildserver/container/container_rsa -p 2222" /var/lib/lightbuildserver/repos/tbits.net/TBitsKolab16Test/centos/7/lbs-tbits.net-TBitsKolab16Test.repo root@build04lxc.lbs.solidcharity.com:/var/lib/lxc/005-build04lxc.lbs.solidcharity.com/rootfs/etc/yum.repos.d
[00:00:40] sending incremental file list
[00:00:40] lbs-tbits.net-TBitsKolab16Test.repo
[00:00:40] 
[00:00:40] sent 252 bytes  received 35 bytes  574.00 bytes/sec
[00:00:40] total size is 169  speedup is 0.59
[00:00:40] now running: ssh -f -o "StrictHostKeyChecking no" -o Port=22 -i /etc/lightbuildserver/container/container_rsa root@10.0.3.5 "export LC_ALL=C; (echo "priority = 60" >> /etc/yum.repos.d/lbs-tbits.net-TBitsKolab16Test.repo) 2>&1 && echo \$?"
[00:00:40] 0
[00:00:40] now running: ssh -f -o "StrictHostKeyChecking no" -o Port=22 -i /etc/lightbuildserver/container/container_rsa root@10.0.3.5 "export LC_ALL=C; (yum clean metadata) 2>&1 && echo \$?"
[00:00:40] Loaded plugins: fastestmirror, priorities
[00:00:41] Cleaning repos: base epel extras lbs-tbits.net-TBitsKolab16Test updates
[00:00:41] 19 metadata files removed
[00:00:41] 9 sqlite files removed
[00:00:41] 0 metadata files removed
[00:00:41] 0
[00:00:41] now running: ssh -f -o "StrictHostKeyChecking no" -o Port=22 -i /etc/lightbuildserver/container/container_rsa root@10.0.3.5 "export LC_ALL=C; (sed -e 's/Release:.*%{release}/Release: 0/g' lbs-TBitsKolab16Test/kolab-webadmin/kolab-webadmin.spec > /tmp/kolab-webadmin.spec) 2>&1 && echo \$?"
[00:00:41] 0
[00:00:41] now running: ssh -f -o "StrictHostKeyChecking no" -o Port=22 -i /etc/lightbuildserver/container/container_rsa root@10.0.3.5 "export LC_ALL=C; (yum-builddep -y /tmp/kolab-webadmin.spec) 2>&1 && echo \$?"
[00:00:41] Loaded plugins: fastestmirror, priorities
[00:00:41] Enabling epel-source repository
[00:00:41] Loading mirror speeds from cached hostfile
[00:00:44]  * base: mirror.ratiokontakt.de
[00:00:45]  * epel: ftp.plusline.net
[00:00:45]  * epel-source: mirror.de.leaseweb.net
[00:00:45]  * extras: mirror.fra10.de.leaseweb.net
[00:00:45]  * updates: centos.mirror.net-d-sign.de
[00:00:52] 3 packages excluded due to repository priority protections
[00:00:52] Checking for new repos for mirrors
[00:00:52] Getting requirements for /tmp/kolab-webadmin.spec
[00:00:52] No uninstalled build requires
[00:00:52] 0
[00:00:52] now running: ssh -f -o "StrictHostKeyChecking no" -o Port=22 -i /etc/lightbuildserver/container/container_rsa root@10.0.3.5 "export LC_ALL=C; (mydevice=\`ip -o route get to 8.8.8.8 | awk '{ print \$5 }'\`; myip=\`ip -o route get to 8.8.8.8 | awk '{ print \$7 }'\`; ip route add \$myip dev \$mydevice) 2>&1 && echo \$?"
[00:00:52] 0
[00:00:52] now running: ssh -f -o "StrictHostKeyChecking no" -o Port=22 -i /etc/lightbuildserver/container/container_rsa root@10.0.3.5 "export LC_ALL=C; (sed -i "s/0%{?suse_version}/0/g" lbs-TBitsKolab16Test/kolab-webadmin/kolab-webadmin.spec) 2>&1 && echo \$?"
[00:00:52] 0
[00:00:52] now running: ssh -f -o "StrictHostKeyChecking no" -o Port=22 -i /etc/lightbuildserver/container/container_rsa root@10.0.3.5 "export LC_ALL=C; (cp lbs-TBitsKolab16Test/kolab-webadmin/kolab-webadmin.spec rpmbuild/SPECS) 2>&1 && echo \$?"
[00:00:52] 0
[00:00:52] now running: ssh -f -o "StrictHostKeyChecking no" -o Port=22 -i /etc/lightbuildserver/container/container_rsa root@10.0.3.5 "export LC_ALL=C; (cp lbs-TBitsKolab16Test/kolab-webadmin/* rpmbuild/SOURCES) 2>&1 && echo \$?"
[00:00:52] 0
[00:00:53] now running: ssh -f -o "StrictHostKeyChecking no" -o Port=22 -i /etc/lightbuildserver/container/container_rsa root@10.0.3.5 "export LC_ALL=C; (mv sources/* rpmbuild/SOURCES) 2>&1 && echo \$?"
[00:00:53] mv: cannot stat 'sources/*': No such file or directory
[00:00:53] now running: rsync -avz -e "ssh -i /etc/lightbuildserver/container/container_rsa -p 2222" root@build04lxc.lbs.solidcharity.com:/var/lib/lxc/005-build04lxc.lbs.solidcharity.com/rootfs/root/rpmbuild/SPECS/kolab-webadmin.spec /tmp/tmpwcs43kug
[00:00:53] receiving incremental file list
[00:00:53] kolab-webadmin.spec
[00:00:53] 
[00:00:53] sent 43 bytes  received 3,445 bytes  6,976.00 bytes/sec
[00:00:53] total size is 11,098  speedup is 3.18
[00:00:53] now running: ssh -f -o "StrictHostKeyChecking no" -o Port=22 -i /etc/lightbuildserver/container/container_rsa root@10.0.3.5 "export LC_ALL=C; (sed -i -e 's/Release:.*%{release}/Release: 0/g' rpmbuild/SPECS/kolab-webadmin.spec) 2>&1 && echo \$?"
[00:00:53] 0
[00:00:53] now running: ssh -f -o "StrictHostKeyChecking no" -o Port=22 -i /etc/lightbuildserver/container/container_rsa root@10.0.3.5 "export LC_ALL=C; (rpmbuild -ba rpmbuild/SPECS/kolab-webadmin.spec) 2>&1 && echo \$?"
[00:00:53] Executing(%prep): /bin/sh -e /var/tmp/rpm-tmp.ly1K36
[00:00:53] + umask 022
[00:00:53] + cd /root/rpmbuild/BUILD
[00:00:53] + cd /root/rpmbuild/BUILD
[00:00:53] + rm -rf kolab-webadmin-3.2.12
[00:00:53] + /usr/bin/gzip -dc /root/rpmbuild/SOURCES/kolab-webadmin-3.2.12.tar.gz
[00:00:53] + /usr/bin/tar -xf -
[00:00:53] + STATUS=0
[00:00:53] + '[' 0 -ne 0 ']'
[00:00:53] + cd kolab-webadmin-3.2.12
[00:00:53] + /usr/bin/chmod -Rf a+rX,u+w,g-w,o-w .
[00:00:53] + echo 'Patch #10 (validateAliasDomainPostfixVirtualFileBug2658.patch):'
[00:00:53] Patch #10 (validateAliasDomainPostfixVirtualFileBug2658.patch):
[00:00:53] + /usr/bin/cat /root/rpmbuild/SOURCES/validateAliasDomainPostfixVirtualFileBug2658.patch
[00:00:53] + /usr/bin/patch -p1 --fuzz=0
[00:00:53] patching file lib/api/kolab_api_service_form_value.php
[00:00:53] Hunk #1 succeeded at 1213 (offset 93 lines).
[00:00:53] Hunk #2 succeeded at 1683 (offset 166 lines).
[00:00:53] + echo 'Patch #11 (patchMultiDomainAdminsBug2018.patch):'
[00:00:53] Patch #11 (patchMultiDomainAdminsBug2018.patch):
[00:00:53] + /usr/bin/patch -p1 --fuzz=0
[00:00:53] + /usr/bin/cat /root/rpmbuild/SOURCES/patchMultiDomainAdminsBug2018.patch
[00:00:53] patching file lib/Auth.php
[00:00:53] Hunk #1 succeeded at 223 (offset 2 lines).
[00:00:53] patching file lib/Auth/LDAP.php
[00:00:53] Hunk #2 succeeded at 201 (offset 7 lines).
[00:00:53] Hunk #3 succeeded at 404 (offset 17 lines).
[00:00:53] Hunk #4 succeeded at 421 (offset 17 lines).
[00:00:53] Hunk #5 succeeded at 484 (offset 21 lines).
[00:00:53] Hunk #7 succeeded at 1559 (offset -229 lines).
[00:00:53] patching file lib/Auth/LDAP.php
[00:00:53] Hunk #1 succeeded at 265 (offset 13 lines).
[00:00:53] Hunk #2 succeeded at 309 (offset 13 lines).
[00:00:53] patching file lib/Auth/LDAP.php
[00:00:53] Hunk #1 succeeded at 1052 (offset -46 lines).
[00:00:53] patching file lib/api/kolab_api_service_domain.php
[00:00:53] Hunk #1 succeeded at 266 (offset 1 line).
[00:00:53] patching file lib/api/kolab_api_service_domain_types.php
[00:00:53] patching file lib/api/kolab_api_service_form_value.php
[00:00:53] Hunk #1 succeeded at 1124 (offset 93 lines).
[00:00:53] Hunk #2 succeeded at 1354 (offset 93 lines).
[00:00:53] Hunk #3 succeeded at 1364 (offset 93 lines).
[00:00:53] Hunk #4 succeeded at 1759 (offset 166 lines).
[00:00:53] patching file lib/client/kolab_client_task_domain.php
[00:00:53] Hunk #1 succeeded at 110 (offset -5 lines).
[00:00:53] Hunk #2 succeeded at 119 (offset -5 lines).
[00:00:53] Hunk #3 succeeded at 145 (offset -35 lines).
[00:00:53] patching file lib/kolab_client_task.php
[00:00:53] Hunk #1 succeeded at 1163 (offset 11 lines).
[00:00:53] patching file lib/client/kolab_client_task_user.php
[00:00:53] patching file lib/kolab_api_service.php
[00:00:53] Hunk #1 succeeded at 111 (offset 1 line).
[00:00:53] Hunk #2 succeeded at 218 (offset 28 lines).
[00:00:53] patching file lib/locale/de_DE.php
[00:00:53] Hunk #1 succeeded at 448 (offset 6 lines).
[00:00:53] patching file lib/locale/en_US.php
[00:00:53] Hunk #1 succeeded at 129 (offset 1 line).
[00:00:53] Hunk #2 succeeded at 386 (offset 7 lines).
[00:00:53] Hunk #3 succeeded at 440 (offset 13 lines).
[00:00:53] patching file lib/kolab_form.php
[00:00:53] patching file public_html/js/kolab_admin.js
[00:00:53] Hunk #1 succeeded at 734 (offset 1 line).
[00:00:53] Hunk #2 succeeded at 773 (offset 1 line).
[00:00:53] patching file lib/Auth/LDAP.php
[00:00:53] Hunk #1 succeeded at 1070 (offset -42 lines).
[00:00:53] patching file lib/kolab_form.php
[00:00:53] Hunk #1 succeeded at 249 (offset -2 lines).
[00:00:53] patching file public_html/js/kolab_admin.js
[00:00:53] patching file public_html/skins/default/style.css
[00:00:53] Hunk #1 succeeded at 633 (offset 3 lines).
[00:00:53] Hunk #2 succeeded at 661 (offset 3 lines).
[00:00:53] Hunk #3 succeeded at 738 (offset 3 lines).
[00:00:53] + echo 'Patch #12 (domainquotaBug2046.patch):'
[00:00:53] Patch #12 (domainquotaBug2046.patch):
[00:00:53] + /usr/bin/patch -p1 --fuzz=0
[00:00:53] + /usr/bin/cat /root/rpmbuild/SOURCES/domainquotaBug2046.patch
[00:00:53] patching file lib/Auth.php
[00:00:53] Hunk #1 succeeded at 233 (offset 2 lines).
[00:00:53] patching file lib/Auth/LDAP.php
[00:00:53] Hunk #1 succeeded at 412 (offset 20 lines).
[00:00:53] patching file lib/api/kolab_api_service_form_value.php
[00:00:53] Hunk #1 succeeded at 1369 (offset 130 lines).
[00:00:53] patching file public_html/js/kolab_admin.js
[00:00:53] Hunk #1 succeeded at 841 (offset 22 lines).
[00:00:53] + echo 'Patch #13 (domainAdminDefaultQuota.patch):'
[00:00:53] Patch #13 (domainAdminDefaultQuota.patch):
[00:00:53] + /usr/bin/patch -p1 --fuzz=0
[00:00:53] + /usr/bin/cat /root/rpmbuild/SOURCES/domainAdminDefaultQuota.patch
[00:00:53] patching file lib/kolab_client_task.php
[00:00:53] Hunk #1 succeeded at 1057 (offset 15 lines).
[00:00:53] + echo 'Patch #14 (domainAdminMaxAccounts.patch):'
[00:00:53] Patch #14 (domainAdminMaxAccounts.patch):
[00:00:53] + /usr/bin/cat /root/rpmbuild/SOURCES/domainAdminMaxAccounts.patch
[00:00:53] + /usr/bin/patch -p1 --fuzz=0
[00:00:53] patching file lib/Auth.php
[00:00:53] Hunk #1 succeeded at 198 (offset 2 lines).
[00:00:53] patching file lib/Auth/LDAP.php
[00:00:53] Hunk #1 succeeded at 436 (offset 19 lines).
[00:00:54] patching file lib/api/kolab_api_service_user.php
[00:00:54] + echo 'Patch #15 (lastLoginTBitsAttribute-wap.patch):'
[00:00:54] Patch #15 (lastLoginTBitsAttribute-wap.patch):
[00:00:54] + /usr/bin/cat /root/rpmbuild/SOURCES/lastLoginTBitsAttribute-wap.patch
[00:00:54] + /usr/bin/patch -p1 --fuzz=0
[00:00:54] patching file lib/Auth/LDAP.php
[00:00:54] Hunk #1 succeeded at 267 (offset -3 lines).
[00:00:54] patching file lib/client/kolab_client_task_settings.php
[00:00:54] patching file lib/client/kolab_client_task_user.php
[00:00:54] patching file lib/kolab_client_task.php
[00:00:54] Hunk #1 succeeded at 884 (offset -8 lines).
[00:00:54] patching file lib/kolab_form.php
[00:00:54] Hunk #2 succeeded at 295 (offset 12 lines).
[00:00:54] patching file lib/kolab_html.php
[00:00:54] Hunk #1 succeeded at 210 (offset 4 lines).
[00:00:54] patching file lib/locale/de_DE.php
[00:00:54] Hunk #1 succeeded at 454 (offset 6 lines).
[00:00:54] patching file lib/locale/en_US.php
[00:00:54] Hunk #1 succeeded at 437 (offset 13 lines).
[00:00:54] + echo 'Patch #16 (quotaused_wap.patch):'
[00:00:54] Patch #16 (quotaused_wap.patch):
[00:00:54] + /usr/bin/cat /root/rpmbuild/SOURCES/quotaused_wap.patch
[00:00:54] + /usr/bin/patch -p1 --fuzz=0
[00:00:54] patching file lib/Auth/LDAP.php
[00:00:54] Hunk #1 succeeded at 268 (offset -3 lines).
[00:00:54] Hunk #2 succeeded at 1099 (offset -3 lines).
[00:00:54] Hunk #3 succeeded at 1108 (offset -3 lines).
[00:00:54] Hunk #4 succeeded at 1159 (offset -3 lines).
[00:00:54] Hunk #5 succeeded at 1223 (offset -3 lines).
[00:00:54] patching file lib/api/kolab_api_service_user.php
[00:00:54] Hunk #1 succeeded at 206 (offset -27 lines).
[00:00:54] patching file lib/client/kolab_client_task_settings.php
[00:00:54] patching file lib/client/kolab_client_task_user.php
[00:00:54] patching file lib/kolab_client_output.php
[00:00:54] patching file lib/kolab_client_task.php
[00:00:54] Hunk #1 succeeded at 893 (offset -21 lines).
[00:00:54] patching file lib/kolab_form.php
[00:00:54] patching file lib/kolab_html.php
[00:00:54] patching file lib/locale/de_DE.php
[00:00:54] Hunk #1 succeeded at 458 (offset -1 lines).
[00:00:54] patching file lib/locale/en_US.php
[00:00:54] + echo 'Patch #18 (canonification_via_uid_wap.patch):'
[00:00:54] Patch #18 (canonification_via_uid_wap.patch):
[00:00:54] + /usr/bin/patch -p1 --fuzz=0
[00:00:54] + /usr/bin/cat /root/rpmbuild/SOURCES/canonification_via_uid_wap.patch
[00:00:54] patching file lib/Auth.php
[00:00:54] Hunk #1 succeeded at 471 (offset 20 lines).
[00:00:54] patching file lib/api/kolab_api_service_form_value.php
[00:00:54] patching file lib/api/kolab_api_service_user.php
[00:00:54] Hunk #1 succeeded at 119 (offset 31 lines).
[00:00:54] Hunk #2 succeeded at 292 (offset 34 lines).
[00:00:54] patching file lib/kolab_client_task.php
[00:00:54] patching file lib/locale/de_DE.php
[00:00:54] patching file lib/locale/en_US.php
[00:00:54] Hunk #1 succeeded at 354 (offset 3 lines).
[00:00:54] + echo 'Patch #19 (listUsersLastLoginQuotaUsage.patch):'
[00:00:54] Patch #19 (listUsersLastLoginQuotaUsage.patch):
[00:00:54] + /usr/bin/patch -p1 --fuzz=0
[00:00:54] + /usr/bin/cat /root/rpmbuild/SOURCES/listUsersLastLoginQuotaUsage.patch
[00:00:54] patching file lib/Auth.php
[00:00:54] patching file lib/Auth/LDAP.php
[00:00:54] patching file lib/api/kolab_api_service_user.php
[00:00:54] patching file lib/api/kolab_api_service_users.php
[00:00:54] patching file lib/client/kolab_client_task_user.php
[00:00:54] patching file lib/locale/de_DE.php
[00:00:54] patching file lib/locale/en_US.php
[00:00:54] + echo 'Patch #20 (intranetToken-wap.patch):'
[00:00:54] Patch #20 (intranetToken-wap.patch):
[00:00:54] + /usr/bin/patch -p1 --fuzz=0
[00:00:54] + /usr/bin/cat /root/rpmbuild/SOURCES/intranetToken-wap.patch
[00:00:54] patching file lib/Auth/LDAP.php
[00:00:54] Hunk #1 succeeded at 270 (offset -2 lines).
[00:00:54] patching file lib/client/kolab_client_task_user.php
[00:00:54] Hunk #1 succeeded at 272 (offset 7 lines).
[00:00:54] Hunk #2 succeeded at 322 (offset 7 lines).
[00:00:54] patching file lib/locale/de_DE.php
[00:00:54] Hunk #1 succeeded at 471 (offset 1 line).
[00:00:54] patching file lib/locale/en_US.php
[00:00:54] Hunk #1 succeeded at 459 (offset 2 lines).
[00:00:54] + echo 'Patch #21 (wap_disallow_users.patch):'
[00:00:54] Patch #21 (wap_disallow_users.patch):
[00:00:54] + /usr/bin/cat /root/rpmbuild/SOURCES/wap_disallow_users.patch
[00:00:54] + /usr/bin/patch -p1 --fuzz=0
[00:00:54] patching file lib/kolab_api_controller.php
[00:00:54] Hunk #1 succeeded at 344 (offset -12 lines).
[00:00:54] + echo 'Patch #22 (dont_generate_attribs_when_editing.patch):'
[00:00:54] Patch #22 (dont_generate_attribs_when_editing.patch):
[00:00:54] + /usr/bin/cat /root/rpmbuild/SOURCES/dont_generate_attribs_when_editing.patch
[00:00:54] + /usr/bin/patch -p1 --fuzz=0
[00:00:54] patching file lib/api/kolab_api_service_form_value.php
[00:00:54] + echo 'Patch #23 (wap_api_listuserswithhash.patch):'
[00:00:54] Patch #23 (wap_api_listuserswithhash.patch):
[00:00:54] + /usr/bin/patch -p1 --fuzz=0
[00:00:54] + /usr/bin/cat /root/rpmbuild/SOURCES/wap_api_listuserswithhash.patch
[00:00:54] patching file lib/api/kolab_api_service_users.php
[00:00:54] patching file lib/kolab_api_controller.php
[00:00:54] patching file lib/api/kolab_api_service_users.php
[00:00:54] Hunk #1 succeeded at 83 (offset 2 lines).
[00:00:54] + cp -af /root/rpmbuild/SOURCES/99tbits.ldif bin/99tbits.ldif
[00:00:54] + cp -af /root/rpmbuild/SOURCES/initTBitsUserTypes.php bin/initTBitsUserTypes.php
[00:00:54] ++ find . -type f -name '*.enterprise'
[00:00:54] + for file in '`find . -type f -name "*.enterprise"`'
[00:00:54] + '[' 0 -gt 0 ']'
[00:00:54] + rm -rvf ./public_html/skins/default/images/favicon.png.enterprise
[00:00:54] removed './public_html/skins/default/images/favicon.png.enterprise'
[00:00:54] + for file in '`find . -type f -name "*.enterprise"`'
[00:00:54] + '[' 0 -gt 0 ']'
[00:00:54] + rm -rvf ./public_html/skins/default/images/logo.png.enterprise
[00:00:54] removed './public_html/skins/default/images/logo.png.enterprise'
[00:00:54] + for file in '`find . -type f -name "*.enterprise"`'
[00:00:54] + '[' 0 -gt 0 ']'
[00:00:54] + rm -rvf ./public_html/skins/default/images/logo-big.png.enterprise
[00:00:54] removed './public_html/skins/default/images/logo-big.png.enterprise'
[00:00:54] + for file in '`find . -type f -name "*.enterprise"`'
[00:00:54] + '[' 0 -gt 0 ']'
[00:00:54] + rm -rvf ./public_html/skins/default/templates/about.html.enterprise
[00:00:54] removed './public_html/skins/default/templates/about.html.enterprise'
[00:00:54] + for file in '`find . -type f -name "*.enterprise"`'
[00:00:54] + '[' 0 -gt 0 ']'
[00:00:54] + rm -rvf ./public_html/skins/default/templates/footer.html.enterprise
[00:00:54] removed './public_html/skins/default/templates/footer.html.enterprise'
[00:00:54] + for file in '`find . -type f -name "*.enterprise"`'
[00:00:54] + '[' 0 -gt 0 ']'
[00:00:54] + rm -rvf ./lib/client/kolab_client_task_about.php.enterprise
[00:00:54] removed './lib/client/kolab_client_task_about.php.enterprise'
[00:00:54] + exit 0
[00:00:54] Executing(%build): /bin/sh -e /var/tmp/rpm-tmp.8PeFf8
[00:00:54] + umask 022
[00:00:54] + cd /root/rpmbuild/BUILD
[00:00:54] + cd kolab-webadmin-3.2.12
[00:00:54] + exit 0
[00:00:54] Executing(%install): /bin/sh -e /var/tmp/rpm-tmp.WtUus9
[00:00:54] + umask 022
[00:00:54] + cd /root/rpmbuild/BUILD
[00:00:54] + '[' /root/rpmbuild/BUILDROOT/kolab-webadmin-3.2.12-107.tbits20190107.el7.x86_64 '!=' / ']'
[00:00:54] + rm -rf /root/rpmbuild/BUILDROOT/kolab-webadmin-3.2.12-107.tbits20190107.el7.x86_64
[00:00:54] ++ dirname /root/rpmbuild/BUILDROOT/kolab-webadmin-3.2.12-107.tbits20190107.el7.x86_64
[00:00:54] + mkdir -p /root/rpmbuild/BUILDROOT
[00:00:54] + mkdir /root/rpmbuild/BUILDROOT/kolab-webadmin-3.2.12-107.tbits20190107.el7.x86_64
[00:00:54] + cd kolab-webadmin-3.2.12
[00:00:54] + mkdir -p /root/rpmbuild/BUILDROOT/kolab-webadmin-3.2.12-107.tbits20190107.el7.x86_64//usr/share/kolab-webadmin/ /root/rpmbuild/BUILDROOT/kolab-webadmin-3.2.12-107.tbits20190107.el7.x86_64//etc/httpd/conf.d/ /root/rpmbuild/BUILDROOT/kolab-webadmin-3.2.12-107.tbits20190107.el7.x86_64//var/log/kolab-webadmin /root/rpmbuild/BUILDROOT/kolab-webadmin-3.2.12-107.tbits20190107.el7.x86_64//var/cache/kolab-webadmin
[00:00:54] + rm -rf lib/ext/
[00:00:54] + cp -a bin /root/rpmbuild/BUILDROOT/kolab-webadmin-3.2.12-107.tbits20190107.el7.x86_64//usr/share/kolab-webadmin/.
[00:00:54] + cp -a lib/ public_html/ hosted/ /root/rpmbuild/BUILDROOT/kolab-webadmin-3.2.12-107.tbits20190107.el7.x86_64//usr/share/kolab-webadmin/.
[00:00:54] + cp -a doc/kolab-webadmin.conf /root/rpmbuild/BUILDROOT/kolab-webadmin-3.2.12-107.tbits20190107.el7.x86_64//etc/httpd/conf.d/
[00:00:54] + cp -a doc/hosted-kolab.conf /root/rpmbuild/BUILDROOT/kolab-webadmin-3.2.12-107.tbits20190107.el7.x86_64//etc/httpd/conf.d/
[00:00:54] + pushd /root/rpmbuild/BUILDROOT/kolab-webadmin-3.2.12-107.tbits20190107.el7.x86_64//usr/share/kolab-webadmin/
[00:00:54] ~/rpmbuild/BUILDROOT/kolab-webadmin-3.2.12-107.tbits20190107.el7.x86_64/usr/share/kolab-webadmin ~/rpmbuild/BUILD/kolab-webadmin-3.2.12
[00:00:54] + ln -s ../../../var/cache/kolab-webadmin cache
[00:00:54] + ln -s ../../../var/log/kolab-webadmin logs
[00:00:54] + pushd hosted/skins/kolabsys
[00:00:54] ~/rpmbuild/BUILDROOT/kolab-webadmin-3.2.12-107.tbits20190107.el7.x86_64/usr/share/kolab-webadmin/hosted/skins/kolabsys ~/rpmbuild/BUILDROOT/kolab-webadmin-3.2.12-107.tbits20190107.el7.x86_64/usr/share/kolab-webadmin ~/rpmbuild/BUILD/kolab-webadmin-3.2.12
[00:00:54] + ln -sf ../../../public_html/skins/default/style.css style.css
[00:00:54] + ln -sf ../../../public_html/skins/default/ui.js ui.js
[00:00:54] + rm -rf images
[00:00:54] + ln -sf ../../../public_html/skins/default/images images
[00:00:54] + popd
[00:00:54] ~/rpmbuild/BUILDROOT/kolab-webadmin-3.2.12-107.tbits20190107.el7.x86_64/usr/share/kolab-webadmin ~/rpmbuild/BUILD/kolab-webadmin-3.2.12
[00:00:54] + popd
[00:00:54] ~/rpmbuild/BUILD/kolab-webadmin-3.2.12
[00:00:54] + /usr/lib/rpm/find-debuginfo.sh --strict-build-id -m --run-dwz --dwz-low-mem-die-limit 10000000 --dwz-max-die-limit 110000000 /root/rpmbuild/BUILD/kolab-webadmin-3.2.12
[00:00:54] /usr/lib/rpm/sepdebugcrcfix: Updated 0 CRC32s, 0 CRC32s did match.
[00:00:54] + /usr/lib/rpm/check-buildroot
[00:00:54] + /usr/lib/rpm/redhat/brp-compress
[00:00:54] + /usr/lib/rpm/redhat/brp-strip-static-archive /usr/bin/strip
[00:00:54] + /usr/lib/rpm/brp-python-bytecompile /usr/bin/python 1
[00:00:54] + /usr/lib/rpm/redhat/brp-python-hardlink
[00:00:54] + /usr/lib/rpm/redhat/brp-java-repack-jars
[00:00:54] Processing files: kolab-webadmin-3.2.12-107.tbits20190107.el7.noarch
[00:00:54] Executing(%doc): /bin/sh -e /var/tmp/rpm-tmp.CXLjeb
[00:00:54] + umask 022
[00:00:54] + cd /root/rpmbuild/BUILD
[00:00:54] + cd kolab-webadmin-3.2.12
[00:00:54] + DOCDIR=/root/rpmbuild/BUILDROOT/kolab-webadmin-3.2.12-107.tbits20190107.el7.x86_64/usr/share/doc/kolab-webadmin-3.2.12
[00:00:54] + export DOCDIR
[00:00:54] + /usr/bin/mkdir -p /root/rpmbuild/BUILDROOT/kolab-webadmin-3.2.12-107.tbits20190107.el7.x86_64/usr/share/doc/kolab-webadmin-3.2.12
[00:00:54] + cp -pr doc/INSTALL doc/LICENSE doc/hosted-kolab.conf doc/kolab-webadmin.conf doc/kolab_wap.oracle.sql doc/kolab_wap.sql doc/sample-insert-group_types.php doc/sample-insert-hosted-user_types.php doc/sample-insert-options.php doc/sample-insert-ou_types.php doc/sample-insert-resource_types.php doc/sample-insert-role_types.php doc/sample-insert-sharedfolder_types.php doc/sample-insert-user_types.php doc/sample-kolab.conf /root/rpmbuild/BUILDROOT/kolab-webadmin-3.2.12-107.tbits20190107.el7.x86_64/usr/share/doc/kolab-webadmin-3.2.12
[00:00:54] + exit 0
[00:00:54] Provides: config(kolab-webadmin) = 3.2.12-107.tbits20190107.el7 kolab-webadmin = 3.2.12-107.tbits20190107.el7
[00:00:54] Requires(interp): /bin/sh /bin/sh
[00:00:54] Requires(rpmlib): rpmlib(CompressedFileNames) <= 3.0.4-1 rpmlib(FileDigests) <= 4.6.0-1 rpmlib(PayloadFilesHavePrefix) <= 4.0-1
[00:00:54] Requires(pre): /bin/sh
[00:00:54] Requires(post): /bin/sh
[00:00:54] Requires: /bin/bash /bin/sh /usr/bin/php
[00:00:54] Checking for unpackaged file(s): /usr/lib/rpm/check-files /root/rpmbuild/BUILDROOT/kolab-webadmin-3.2.12-107.tbits20190107.el7.x86_64
[00:00:54] Wrote: /root/rpmbuild/SRPMS/kolab-webadmin-3.2.12-107.tbits20190107.el7.src.rpm
[00:00:54] Wrote: /root/rpmbuild/RPMS/noarch/kolab-webadmin-3.2.12-107.tbits20190107.el7.noarch.rpm
[00:00:54] Executing(%clean): /bin/sh -e /var/tmp/rpm-tmp.uWrdil
[00:00:54] + umask 022
[00:00:54] + cd /root/rpmbuild/BUILD
[00:00:54] + cd kolab-webadmin-3.2.12
[00:00:54] + /usr/bin/rm -rf /root/rpmbuild/BUILDROOT/kolab-webadmin-3.2.12-107.tbits20190107.el7.x86_64
[00:00:54] + exit 0
[00:00:54] 0
[00:00:54] now running: ssh -f -o "StrictHostKeyChecking no" -o Port=22 -i /etc/lightbuildserver/container/container_rsa root@10.0.3.5 "export LC_ALL=C; (mkdir -p ~/repo/src) 2>&1 && echo \$?"
[00:00:55] 0
[00:00:55] now running: ssh -f -o "StrictHostKeyChecking no" -o Port=22 -i /etc/lightbuildserver/container/container_rsa root@10.0.3.5 "export LC_ALL=C; (cp ~/rpmbuild/SRPMS/*.src.rpm ~/repo/src) 2>&1 && echo \$?"
[00:00:55] 0
[00:00:55] now running: ssh -f -o "StrictHostKeyChecking no" -o Port=22 -i /etc/lightbuildserver/container/container_rsa root@10.0.3.5 "export LC_ALL=C; (cp -R ~/rpmbuild/RPMS/* ~/repo) 2>&1 && echo \$?"
[00:00:55] 0
[00:00:55] now running: ssh -f -o "StrictHostKeyChecking no" -o Port=22 -i /etc/lightbuildserver/container/container_rsa root@10.0.3.5 "export LC_ALL=C; (cd repo && createrepo .) 2>&1 && echo \$?"
[00:00:56] Spawning worker 0 with 18 pkgs
[00:00:56] Spawning worker 1 with 17 pkgs
[00:00:56] Workers Finished
[00:00:56] Saving Primary metadata
[00:00:56] Saving file lists metadata
[00:00:56] Saving other metadata
[00:00:56] Generating sqlite DBs
[00:00:56] Sqlite DBs complete
[00:00:56] 0
[00:00:56] now running: rsync -avz --delete -e "ssh -i /etc/lightbuildserver/container/container_rsa -p 2222" root@build04lxc.lbs.solidcharity.com:/mnt/var/lib/lightbuildserver/repos/tbits.net/TBitsKolab16Test/centos/7 /var/lib/lightbuildserver/repos/tbits.net/TBitsKolab16Test/centos
[00:00:56] receiving incremental file list
[00:00:56] deleting 7/repodata/aa2346f360c62a800aea7a13e50b17d4bab18f2b1144aa74dc52e387194f5ed6-other.sqlite.bz2
[00:00:56] deleting 7/repodata/7eef1af465728392d242c7312a6f9c73a3fbc8be949ff934eda76bb37a4a492f-other.xml.gz
[00:00:56] deleting 7/repodata/79dc3612be06c9ddba161124eea3c9cc87e643ccb1d78fba3b23e9524ab780c2-filelists.xml.gz
[00:00:56] deleting 7/repodata/6e278e9023ccde0520a87d622ba95894eb04937cdbee6223707a11f3a6b56761-filelists.sqlite.bz2
[00:00:56] deleting 7/repodata/31bec0dad09d9a47543e71c63d6b60d706eac1cbca6c8a250dfe2063d9cb0344-primary.sqlite.bz2
[00:00:56] deleting 7/repodata/0008fc6b199fe137d1397aee37ab063daf3af24dba0dd6bf527540318891953a-primary.xml.gz
[00:00:56] 7/
[00:00:56] 7/noarch/
[00:00:56] 7/noarch/kolab-webadmin-3.2.12-107.tbits20190107.el7.noarch.rpm
[00:00:56] 7/repodata/
[00:00:56] 7/repodata/435810601f0c07b48bb82d5bc80c064703d9bcc81a546b387a61e5df37d0f94e-primary.xml.gz
[00:00:56] 7/repodata/4b05802dde54c4f7be8ce88038c1817065e64b304e0ba342a4f1c1a5150c96c1-other.sqlite.bz2
[00:00:56] 7/repodata/6b042bf761b41e3327b72d8d717b4f626b892f665d195cbb1db9cd79947bd4d3-other.xml.gz
[00:00:56] 7/repodata/6d7154ef1c75bdeb82ebb02a36caf9e35d04228f27876fd704e968267ae794b3-primary.sqlite.bz2
[00:00:56] 7/repodata/927ab055c3dc2ae913b29166daba8790b1b74ec155a1a8f4711473365c4f8156-filelists.sqlite.bz2
[00:00:56] 7/repodata/a7f91541a0add75168d90d49b5de844f712c795c22e847c44539eaa779aaf286-filelists.xml.gz
[00:00:56] 7/repodata/repomd.xml
[00:00:56] 7/src/
[00:00:56] 7/src/kolab-webadmin-3.2.12-107.tbits20190107.el7.src.rpm
[00:00:56] 
[00:00:56] sent 254 bytes  received 1,073,167 bytes  2,146,842.00 bytes/sec
[00:00:56] total size is 40,554,591  speedup is 37.78
[00:00:56] now running: rsync -avz --delete -e "ssh -i /etc/lightbuildserver/container/container_rsa -p 2222" root@build04lxc.lbs.solidcharity.com:/mnt/var/lib/lightbuildserver/tarballs/tbits.net/TBitsKolab16Test /var/lib/lightbuildserver/tarballs/tbits.net
[00:00:57] receiving incremental file list
[00:00:57] 
[00:00:57] sent 25 bytes  received 64 bytes  59.33 bytes/sec
[00:00:57] total size is 0  speedup is 0.00
[00:00:57] Success!
[00:01:10] This build took about 1 minutes

	
go to top of this page