Build Result for solidcharity/openpetra/openpetranow-mysql-test/test

go to bottom of this page
[00:00:00]  * Starting at 2019-02-02 22:39:11 GMT+0100
[00:00:00]  * Preparing the machine...
[00:00:00] now running: ssh -f -o "StrictHostKeyChecking no" -p 2222 -i /etc/lightbuildserver/container/container_rsa root@build04lxc.lbs.solidcharity.com "export LC_ALL=C; (if [ -d /var/lib/lxc/005-build04lxc.lbs.solidcharity.com ]; then lxc-destroy --name 005-build04lxc.lbs.solidcharity.com; fi) 2>&1; echo \$?"
[00:00:03] lxc-destroy: 005-build04lxc.lbs.solidcharity.com: tools/lxc_destroy.c: main: 271 Destroyed container 005-build04lxc.lbs.solidcharity.com
[00:00:03] 0
[00:00:03] now running: ssh -f -o "StrictHostKeyChecking no" -p 2222 -i /etc/lightbuildserver/container/container_rsa root@build04lxc.lbs.solidcharity.com "export LC_ALL=C; (/usr/share/lxc-scripts/initLXC.sh) 2>&1; echo \$?"
[00:00:03] patching file lxc-fedora
[00:00:03] Hunk #1 FAILED at 562.
[00:00:03] Hunk #2 FAILED at 570.
[00:00:03] Hunk #3 FAILED at 647.
[00:00:03] Hunk #4 FAILED at 680.
[00:00:03] Hunk #5 FAILED at 813.
[00:00:03] Hunk #6 succeeded at 2294 (offset 1103 lines).
[00:00:03] 5 out of 6 hunks FAILED -- saving rejects to file lxc-fedora.rej
[00:00:03] patching file lxc-fedora
[00:00:03] Hunk #1 FAILED at 687.
[00:00:03] Hunk #2 FAILED at 695.
[00:00:03] Hunk #3 FAILED at 809.
[00:00:03] Hunk #4 FAILED at 1016.
[00:00:03] 4 out of 4 hunks FAILED -- saving rejects to file lxc-fedora.rej
[00:00:04] 0
[00:00:04] now running: ssh -f -o "StrictHostKeyChecking no" -p 2222 -i /etc/lightbuildserver/container/container_rsa root@build04lxc.lbs.solidcharity.com "export LC_ALL=C; (/usr/share/lxc-scripts/initCentOS.sh 005-build04lxc.lbs.solidcharity.com 5 7 amd64 0) 2>&1; echo \$?"
[00:00:04] Using image from local cache
[00:00:04] Unpacking the rootfs
[00:00:11] 
[00:00:11] ---
[00:00:11] You just created a Centos 7 x86_64 (20190131_07:09) container.
[00:00:11] Host 10.0.3.5 not found in /root/.ssh/known_hosts
[00:00:11] /root
[00:00:12] Loaded plugins: fastestmirror
[00:00:12] Loading mirror speeds from cached hostfile
[00:00:12] Could not retrieve mirrorlist http://mirrorlist.centos.org/?release=7&arch=x86_64&repo=os&infra=stock error was
[00:00:12] 14: curl#7 - "Failed to connect to 2001:4178:5:200::10: Network is unreachable"
[00:00:12] Could not retrieve mirrorlist http://mirrorlist.centos.org/?release=7&arch=x86_64&repo=extras&infra=stock error was
[00:00:12] 14: curl#7 - "Failed to connect to 2001:4178:5:200::10: Network is unreachable"
[00:00:12] Could not retrieve mirrorlist http://mirrorlist.centos.org/?release=7&arch=x86_64&repo=updates&infra=stock error was
[00:00:12] 14: curl#7 - "Failed to connect to 2001:4178:5:200::10: Network is unreachable"
[00:00:12]  * base: ftp.plusline.net
[00:00:12]  * extras: mirror.imt-systems.com
[00:00:12]  * updates: mirror.fra10.de.leaseweb.net
[00:00:12] http://mirror.eu.oneandone.net/linux/distributions/centos/7.6.1810/os/x86_64/repodata/repomd.xml: [Errno 14] curl#7 - "Failed to connect to 2001:8d8:5c0:404::3: Network is unreachable"
[00:00:12] Trying other mirror.
[00:00:12] http://centos.schlundtech.de/7.6.1810/os/x86_64/repodata/repomd.xml: [Errno 14] curl#7 - "Failed to connect to 2001:67c:299c:3999:91:237:88:60: Network is unreachable"
[00:00:12] Trying other mirror.
[00:00:12] http://ftp.plusline.net/centos/7.6.1810/os/x86_64/repodata/repomd.xml: [Errno 14] curl#7 - "Failed to connect to 2a02:2e0:414:102:d::54: Network is unreachable"
[00:00:12] Trying other mirror.
[00:00:12] http://centos.mirror.net-d-sign.de/7.6.1810/os/x86_64/repodata/repomd.xml: [Errno 14] curl#7 - "Failed to connect to 2a03:2cc0:1197::2c2a: Network is unreachable"
[00:00:12] Trying other mirror.
[00:00:12] http://mirror1.hs-esslingen.de/pub/Mirrors/centos/7.6.1810/os/x86_64/repodata/repomd.xml: [Errno 14] curl#7 - "Failed to connect to 2001:7c0:700::10: Network is unreachable"
[00:00:12] Trying other mirror.
[00:00:12] http://mirror.softaculous.com/centos/7.6.1810/os/x86_64/repodata/repomd.xml: [Errno 14] curl#7 - "Failed to connect to 138.201.24.82: Network is unreachable"
[00:00:12] Trying other mirror.
[00:00:12] http://mirror.cuegee.de/centos/7.6.1810/os/x86_64/repodata/repomd.xml: [Errno 14] curl#7 - "Failed to connect to 2a07:4400:0:1001::11: Network is unreachable"
[00:00:12] Trying other mirror.
[00:00:12] http://mirror.wiuwiu.de/centos/7.6.1810/os/x86_64/repodata/repomd.xml: [Errno 14] curl#7 - "Failed to connect to 2a01:4f8:190:30e1::2: Network is unreachable"
[00:00:12] Trying other mirror.
[00:00:12] http://mirror.23media.de/centos/7.6.1810/os/x86_64/repodata/repomd.xml: [Errno 14] curl#7 - "Failed to connect to 2a00:f48:1007::80: Network is unreachable"
[00:00:12] Trying other mirror.
[00:00:12] http://ftp.halifax.rwth-aachen.de/centos/7.6.1810/os/x86_64/repodata/repomd.xml: [Errno 14] curl#7 - "Failed to connect to 2a00:8a60:e012:a00::21: Network is unreachable"
[00:00:12] Trying other mirror.
[00:00:12] http://ftp.rz.uni-frankfurt.de/pub/mirrors/centos/7.6.1810/extras/x86_64/repodata/repomd.xml: [Errno 14] curl#7 - "Failed to connect to 141.2.36.179: Network is unreachable"
[00:00:12] Trying other mirror.
[00:00:12] http://mirror.ratiokontakt.de/mirror/centos/7.6.1810/extras/x86_64/repodata/repomd.xml: [Errno 14] curl#7 - "Failed to connect to 2a02:708:0:20::2: Network is unreachable"
[00:00:12] Trying other mirror.
[00:00:12] http://mirror.imt-systems.com/centos/7.6.1810/extras/x86_64/repodata/repomd.xml: [Errno 14] curl#7 - "Failed to connect to 2a01:7e0:0:201::10:20: Network is unreachable"
[00:00:12] Trying other mirror.
[00:00:12] http://mirror.alpha-labs.net/centos/7.6.1810/extras/x86_64/repodata/repomd.xml: [Errno 14] curl#7 - "Failed to connect to 2a01:1f8:2000::55: Network is unreachable"
[00:00:12] Trying other mirror.
[00:00:13] Resolving Dependencies
[00:00:13] --> Running transaction check
[00:00:13] ---> Package openssh-server.x86_64 0:7.4p1-16.el7 will be installed
[00:00:13] --> Processing Dependency: libwrap.so.0()(64bit) for package: openssh-server-7.4p1-16.el7.x86_64
[00:00:13] --> Running transaction check
[00:00:13] ---> Package tcp_wrappers-libs.x86_64 0:7.6-77.el7 will be installed
[00:00:13] --> Finished Dependency Resolution
[00:00:13] 
[00:00:13] Dependencies Resolved
[00:00:13] 
[00:00:13] ================================================================================
[00:00:13]  Package                  Arch          Version               Repository   Size
[00:00:13] ================================================================================
[00:00:13] Installing:
[00:00:13]  openssh-server           x86_64        7.4p1-16.el7          base        458 k
[00:00:13] Installing for dependencies:
[00:00:13]  tcp_wrappers-libs        x86_64        7.6-77.el7            base         66 k
[00:00:13] 
[00:00:13] Transaction Summary
[00:00:13] ================================================================================
[00:00:13] Install  1 Package (+1 Dependent package)
[00:00:13] 
[00:00:13] Total size: 525 k
[00:00:13] Installed size: 1.1 M
[00:00:13] Downloading packages:
[00:00:13] Running transaction check
[00:00:13] Running transaction test
[00:00:13] Transaction test succeeded
[00:00:13] Running transaction
[00:00:14]   Installing : tcp_wrappers-libs-7.6-77.el7.x86_64                          1/2 
[00:00:14]   Installing : openssh-server-7.4p1-16.el7.x86_64                           2/2 
[00:00:14]   Verifying  : tcp_wrappers-libs-7.6-77.el7.x86_64                          1/2 
[00:00:14]   Verifying  : openssh-server-7.4p1-16.el7.x86_64                           2/2 
[00:00:14] 
[00:00:14] Installed:
[00:00:14]   openssh-server.x86_64 0:7.4p1-16.el7                                          
[00:00:14] 
[00:00:14] Dependency Installed:
[00:00:14]   tcp_wrappers-libs.x86_64 0:7.6-77.el7                                         
[00:00:14] 
[00:00:14] Complete!
[00:00:17] Removing password for user root.
[00:00:17] passwd: Success
[00:00:17] To setup port forwarding from outside, please run:
[00:00:17] ./tunnelport.sh 5 22
[00:00:17] ./initWebproxy.sh 5 www.005-build04lxc.lbs.solidcharity.com.de
[00:00:17] 
[00:00:17] To start the container, run: lxc-start -d -n 005-build04lxc.lbs.solidcharity.com
[00:00:17] 
[00:00:17] To connect to the container locally, run: eval `ssh-agent`; ssh-add; ssh root@10.0.3.5
[00:00:17] 0
[00:00:17] now running: ssh -f -o "StrictHostKeyChecking no" -p 2222 -i /etc/lightbuildserver/container/container_rsa root@build04lxc.lbs.solidcharity.com "export LC_ALL=C; (/usr/share/lxc-scripts/tunnelport.sh 5 22) 2>&1; echo \$?"
[00:00:18] outward interface: ens18
[00:00:18] outward IP address: 80.241.214.124
[00:00:18] bridge interface: lxcbr0
[00:00:18] bridge address: 10.0.3.1
[00:00:18] guestip: 10.0.3.5
[00:00:18] there is already a mapping for port  2005
[00:00:18] 0
[00:00:18] now running: ssh -f -o "StrictHostKeyChecking no" -p 2222 -i /etc/lightbuildserver/container/container_rsa root@build04lxc.lbs.solidcharity.com "export LC_ALL=C; (mkdir -p /var/lib/lxc/005-build04lxc.lbs.solidcharity.com/rootfs/root/.ssh/) 2>&1; echo \$?"
[00:00:18] 0
[00:00:18] now running: echo "put /etc/lightbuildserver/container/container_rsa.pub authorized_keys2" | sftp -o "StrictHostKeyChecking no" -oPort=2222 -i /etc/lightbuildserver/container/container_rsa root@build04lxc.lbs.solidcharity.com:/var/lib/lxc/005-build04lxc.lbs.solidcharity.com/rootfs/root/.ssh/
[00:00:18] Connected to build04lxc.lbs.solidcharity.com.
[00:00:18] Changing to: /var/lib/lxc/005-build04lxc.lbs.solidcharity.com/rootfs/root/.ssh/
[00:00:18] sftp> put /etc/lightbuildserver/container/container_rsa.pub authorized_keys2
[00:00:18] Uploading /etc/lightbuildserver/container/container_rsa.pub to /var/lib/lxc/005-build04lxc.lbs.solidcharity.com/rootfs/root/.ssh/authorized_keys2
[00:00:18] now running: ssh -f -o "StrictHostKeyChecking no" -p 2222 -i /etc/lightbuildserver/container/container_rsa root@build04lxc.lbs.solidcharity.com "export LC_ALL=C; (cd /var/lib/lxc/005-build04lxc.lbs.solidcharity.com/rootfs/root/.ssh/ && cat authorized_keys2 >> authorized_keys && rm authorized_keys2) 2>&1; echo \$?"
[00:00:19] 0
[00:00:19] now running: ssh -f -o "StrictHostKeyChecking no" -p 2222 -i /etc/lightbuildserver/container/container_rsa root@build04lxc.lbs.solidcharity.com "export LC_ALL=C; (chmod 700 /var/lib/lxc/005-build04lxc.lbs.solidcharity.com/rootfs/root/.ssh/ && chmod 600 /var/lib/lxc/005-build04lxc.lbs.solidcharity.com/rootfs/root/.ssh/authorized_keys) 2>&1; echo \$?"
[00:00:19] 0
[00:00:19] now running: ssh -f -o "StrictHostKeyChecking no" -p 2222 -i /etc/lightbuildserver/container/container_rsa root@build04lxc.lbs.solidcharity.com "export LC_ALL=C; (/usr/share/lxc-scripts/initMount.sh /mnt/var/lib/lightbuildserver/repos/solidcharity/openpetra/centos/7 005-build04lxc.lbs.solidcharity.com /root/repo) 2>&1; echo \$?"
[00:00:19] 0
[00:00:19] now running: rsync -avz --delete -e "ssh -i /etc/lightbuildserver/container/container_rsa -p 2222" /var/lib/lightbuildserver/repos/solidcharity/openpetra/centos/7 root@build04lxc.lbs.solidcharity.com:/mnt/var/lib/lightbuildserver/repos/solidcharity/openpetra/centos
[00:00:20] sending incremental file list
[00:00:20] 
[00:00:20] sent 4,879 bytes  received 20 bytes  9,798.00 bytes/sec
[00:00:20] total size is 1,045,938,284  speedup is 213,500.36
[00:00:20] now running: ssh -f -o "StrictHostKeyChecking no" -p 2222 -i /etc/lightbuildserver/container/container_rsa root@build04lxc.lbs.solidcharity.com "export LC_ALL=C; (/usr/share/lxc-scripts/initMount.sh /mnt/var/lib/lightbuildserver/tarballs/solidcharity/openpetra 005-build04lxc.lbs.solidcharity.com /root/tarball) 2>&1; echo \$?"
[00:00:20] 0
[00:00:20] now running: rsync -avz --delete -e "ssh -i /etc/lightbuildserver/container/container_rsa -p 2222" /var/lib/lightbuildserver/tarballs/solidcharity/openpetra root@build04lxc.lbs.solidcharity.com:/mnt/var/lib/lightbuildserver/tarballs/solidcharity
[00:00:20] sending incremental file list
[00:00:20] 
[00:00:20] sent 633 bytes  received 17 bytes  433.33 bytes/sec
[00:00:20] total size is 571,479,859  speedup is 879,199.78
[00:00:20] now running: ssh -f -o "StrictHostKeyChecking no" -p 2222 -i /etc/lightbuildserver/container/container_rsa root@build04lxc.lbs.solidcharity.com "export LC_ALL=C; (lxc-start -d -n 005-build04lxc.lbs.solidcharity.com) 2>&1; echo \$?"
[00:00:21] 0
[00:00:21] now running: ssh-keygen -f "/run/uwsgi/.ssh/known_hosts" -R 10.0.3.5
[00:00:21] # Host 10.0.3.5 found: line 5
[00:00:21] /run/uwsgi/.ssh/known_hosts updated.
[00:00:21] Original contents retained as /run/uwsgi/.ssh/known_hosts.old
[00:00:21] now running: ssh -f -o "StrictHostKeyChecking no" -o Port=22 -i /etc/lightbuildserver/container/container_rsa root@10.0.3.5 "export LC_ALL=C; (echo "container is running") 2>&1 && echo \$?"
[00:00:21] ssh: connect to host 10.0.3.5 port 22: Connection refused
[00:00:21] now running: ssh -f -o "StrictHostKeyChecking no" -o Port=22 -i /etc/lightbuildserver/container/container_rsa root@10.0.3.5 "export LC_ALL=C; (echo "container is running") 2>&1 && echo \$?"
[00:00:21] Warning: Permanently added '10.0.3.5' (ECDSA) to the list of known hosts.
[00:00:21] container is running
[00:00:21] 0
[00:00:21] container has been started successfully
[00:00:21] now running: ssh -f -o "StrictHostKeyChecking no" -o Port=22 -i /etc/lightbuildserver/container/container_rsa root@10.0.3.5 "export LC_ALL=C; (yum -y install tar createrepo gcc rpm-build rpm-sign gnupg make curl iptables rsync perl iproute yum-utils yum-plugin-priorities) 2>&1 && echo \$?"
[00:00:22] Loaded plugins: fastestmirror
[00:00:22] Loading mirror speeds from cached hostfile
[00:00:22]  * base: ftp.plusline.net
[00:00:22]  * extras: mirror.ratiokontakt.de
[00:00:22]  * updates: mirror.fra10.de.leaseweb.net
[00:00:22] Package 2:tar-1.26-35.el7.x86_64 already installed and latest version
[00:00:22] Package gnupg2-2.0.22-5.el7_5.x86_64 already installed and latest version
[00:00:22] Package curl-7.29.0-51.el7.x86_64 already installed and latest version
[00:00:22] Package iptables-1.4.21-28.el7.x86_64 already installed and latest version
[00:00:22] Package iproute-4.11.0-14.el7.x86_64 already installed and latest version
[00:00:22] Resolving Dependencies
[00:00:22] --> Running transaction check
[00:00:22] ---> Package createrepo.noarch 0:0.9.9-28.el7 will be installed
[00:00:22] --> Processing Dependency: python-deltarpm for package: createrepo-0.9.9-28.el7.noarch
[00:00:22] --> Processing Dependency: libxml2-python for package: createrepo-0.9.9-28.el7.noarch
[00:00:22] --> Processing Dependency: deltarpm for package: createrepo-0.9.9-28.el7.noarch
[00:00:22] ---> Package gcc.x86_64 0:4.8.5-36.el7 will be installed
[00:00:22] --> Processing Dependency: libgomp = 4.8.5-36.el7 for package: gcc-4.8.5-36.el7.x86_64
[00:00:22] --> Processing Dependency: cpp = 4.8.5-36.el7 for package: gcc-4.8.5-36.el7.x86_64
[00:00:22] --> Processing Dependency: glibc-devel >= 2.2.90-12 for package: gcc-4.8.5-36.el7.x86_64
[00:00:22] --> Processing Dependency: libmpfr.so.4()(64bit) for package: gcc-4.8.5-36.el7.x86_64
[00:00:22] --> Processing Dependency: libmpc.so.3()(64bit) for package: gcc-4.8.5-36.el7.x86_64
[00:00:22] --> Processing Dependency: libgomp.so.1()(64bit) for package: gcc-4.8.5-36.el7.x86_64
[00:00:22] ---> Package make.x86_64 1:3.82-23.el7 will be installed
[00:00:22] ---> Package perl.x86_64 4:5.16.3-294.el7_6 will be installed
[00:00:22] --> Processing Dependency: perl-libs = 4:5.16.3-294.el7_6 for package: 4:perl-5.16.3-294.el7_6.x86_64
[00:00:22] --> Processing Dependency: perl(Socket) >= 1.3 for package: 4:perl-5.16.3-294.el7_6.x86_64
[00:00:22] --> Processing Dependency: perl(Scalar::Util) >= 1.10 for package: 4:perl-5.16.3-294.el7_6.x86_64
[00:00:22] --> Processing Dependency: perl-macros for package: 4:perl-5.16.3-294.el7_6.x86_64
[00:00:22] --> Processing Dependency: perl-libs for package: 4:perl-5.16.3-294.el7_6.x86_64
[00:00:22] --> Processing Dependency: perl(threads::shared) for package: 4:perl-5.16.3-294.el7_6.x86_64
[00:00:22] --> Processing Dependency: perl(threads) for package: 4:perl-5.16.3-294.el7_6.x86_64
[00:00:22] --> Processing Dependency: perl(constant) for package: 4:perl-5.16.3-294.el7_6.x86_64
[00:00:22] --> Processing Dependency: perl(Time::Local) for package: 4:perl-5.16.3-294.el7_6.x86_64
[00:00:22] --> Processing Dependency: perl(Time::HiRes) for package: 4:perl-5.16.3-294.el7_6.x86_64
[00:00:22] --> Processing Dependency: perl(Storable) for package: 4:perl-5.16.3-294.el7_6.x86_64
[00:00:22] --> Processing Dependency: perl(Socket) for package: 4:perl-5.16.3-294.el7_6.x86_64
[00:00:22] --> Processing Dependency: perl(Scalar::Util) for package: 4:perl-5.16.3-294.el7_6.x86_64
[00:00:22] --> Processing Dependency: perl(Pod::Simple::XHTML) for package: 4:perl-5.16.3-294.el7_6.x86_64
[00:00:22] --> Processing Dependency: perl(Pod::Simple::Search) for package: 4:perl-5.16.3-294.el7_6.x86_64
[00:00:22] --> Processing Dependency: perl(Getopt::Long) for package: 4:perl-5.16.3-294.el7_6.x86_64
[00:00:22] --> Processing Dependency: perl(Filter::Util::Call) for package: 4:perl-5.16.3-294.el7_6.x86_64
[00:00:22] --> Processing Dependency: perl(File::Temp) for package: 4:perl-5.16.3-294.el7_6.x86_64
[00:00:22] --> Processing Dependency: perl(File::Spec::Unix) for package: 4:perl-5.16.3-294.el7_6.x86_64
[00:00:22] --> Processing Dependency: perl(File::Spec::Functions) for package: 4:perl-5.16.3-294.el7_6.x86_64
[00:00:22] --> Processing Dependency: perl(File::Spec) for package: 4:perl-5.16.3-294.el7_6.x86_64
[00:00:22] --> Processing Dependency: perl(File::Path) for package: 4:perl-5.16.3-294.el7_6.x86_64
[00:00:22] --> Processing Dependency: perl(Exporter) for package: 4:perl-5.16.3-294.el7_6.x86_64
[00:00:22] --> Processing Dependency: perl(Cwd) for package: 4:perl-5.16.3-294.el7_6.x86_64
[00:00:22] --> Processing Dependency: perl(Carp) for package: 4:perl-5.16.3-294.el7_6.x86_64
[00:00:22] --> Processing Dependency: libperl.so()(64bit) for package: 4:perl-5.16.3-294.el7_6.x86_64
[00:00:22] ---> Package rpm-build.x86_64 0:4.11.3-35.el7 will be installed
[00:00:22] --> Processing Dependency: patch >= 2.5 for package: rpm-build-4.11.3-35.el7.x86_64
[00:00:22] --> Processing Dependency: elfutils >= 0.128 for package: rpm-build-4.11.3-35.el7.x86_64
[00:00:22] --> Processing Dependency: unzip for package: rpm-build-4.11.3-35.el7.x86_64
[00:00:22] --> Processing Dependency: system-rpm-config for package: rpm-build-4.11.3-35.el7.x86_64
[00:00:22] --> Processing Dependency: perl(Thread::Queue) for package: rpm-build-4.11.3-35.el7.x86_64
[00:00:22] --> Processing Dependency: file for package: rpm-build-4.11.3-35.el7.x86_64
[00:00:22] --> Processing Dependency: bzip2 for package: rpm-build-4.11.3-35.el7.x86_64
[00:00:22] --> Processing Dependency: /usr/bin/gdb-add-index for package: rpm-build-4.11.3-35.el7.x86_64
[00:00:22] ---> Package rpm-sign.x86_64 0:4.11.3-35.el7 will be installed
[00:00:22] ---> Package rsync.x86_64 0:3.1.2-4.el7 will be installed
[00:00:22] ---> Package yum-plugin-priorities.noarch 0:1.1.31-50.el7 will be installed
[00:00:22] ---> Package yum-utils.noarch 0:1.1.31-50.el7 will be installed
[00:00:22] --> Processing Dependency: python-kitchen for package: yum-utils-1.1.31-50.el7.noarch
[00:00:22] --> Running transaction check
[00:00:22] ---> Package bzip2.x86_64 0:1.0.6-13.el7 will be installed
[00:00:22] ---> Package cpp.x86_64 0:4.8.5-36.el7 will be installed
[00:00:22] ---> Package deltarpm.x86_64 0:3.6-3.el7 will be installed
[00:00:22] ---> Package elfutils.x86_64 0:0.172-2.el7 will be installed
[00:00:22] ---> Package file.x86_64 0:5.11-35.el7 will be installed
[00:00:22] ---> Package gdb.x86_64 0:7.6.1-114.el7 will be installed
[00:00:22] ---> Package glibc-devel.x86_64 0:2.17-260.el7_6.3 will be installed
[00:00:22] --> Processing Dependency: glibc-headers = 2.17-260.el7_6.3 for package: glibc-devel-2.17-260.el7_6.3.x86_64
[00:00:22] --> Processing Dependency: glibc = 2.17-260.el7_6.3 for package: glibc-devel-2.17-260.el7_6.3.x86_64
[00:00:22] --> Processing Dependency: glibc-headers for package: glibc-devel-2.17-260.el7_6.3.x86_64
[00:00:22] ---> Package libgomp.x86_64 0:4.8.5-36.el7 will be installed
[00:00:22] ---> Package libmpc.x86_64 0:1.0.1-3.el7 will be installed
[00:00:22] ---> Package libxml2-python.x86_64 0:2.9.1-6.el7_2.3 will be installed
[00:00:22] ---> Package mpfr.x86_64 0:3.1.1-4.el7 will be installed
[00:00:22] ---> Package patch.x86_64 0:2.7.1-10.el7_5 will be installed
[00:00:22] ---> Package perl-Carp.noarch 0:1.26-244.el7 will be installed
[00:00:22] ---> Package perl-Exporter.noarch 0:5.68-3.el7 will be installed
[00:00:22] ---> Package perl-File-Path.noarch 0:2.09-2.el7 will be installed
[00:00:22] ---> Package perl-File-Temp.noarch 0:0.23.01-3.el7 will be installed
[00:00:22] ---> Package perl-Filter.x86_64 0:1.49-3.el7 will be installed
[00:00:22] ---> Package perl-Getopt-Long.noarch 0:2.40-3.el7 will be installed
[00:00:22] --> Processing Dependency: perl(Pod::Usage) >= 1.14 for package: perl-Getopt-Long-2.40-3.el7.noarch
[00:00:22] --> Processing Dependency: perl(Text::ParseWords) for package: perl-Getopt-Long-2.40-3.el7.noarch
[00:00:22] ---> Package perl-PathTools.x86_64 0:3.40-5.el7 will be installed
[00:00:22] ---> Package perl-Pod-Simple.noarch 1:3.28-4.el7 will be installed
[00:00:22] --> Processing Dependency: perl(Pod::Escapes) >= 1.04 for package: 1:perl-Pod-Simple-3.28-4.el7.noarch
[00:00:22] --> Processing Dependency: perl(Encode) for package: 1:perl-Pod-Simple-3.28-4.el7.noarch
[00:00:22] ---> Package perl-Scalar-List-Utils.x86_64 0:1.27-248.el7 will be installed
[00:00:22] ---> Package perl-Socket.x86_64 0:2.010-4.el7 will be installed
[00:00:22] ---> Package perl-Storable.x86_64 0:2.45-3.el7 will be installed
[00:00:22] ---> Package perl-Thread-Queue.noarch 0:3.02-2.el7 will be installed
[00:00:22] ---> Package perl-Time-HiRes.x86_64 4:1.9725-3.el7 will be installed
[00:00:22] ---> Package perl-Time-Local.noarch 0:1.2300-2.el7 will be installed
[00:00:22] ---> Package perl-constant.noarch 0:1.27-2.el7 will be installed
[00:00:22] ---> Package perl-libs.x86_64 4:5.16.3-294.el7_6 will be installed
[00:00:22] ---> Package perl-macros.x86_64 4:5.16.3-294.el7_6 will be installed
[00:00:22] ---> Package perl-threads.x86_64 0:1.87-4.el7 will be installed
[00:00:22] ---> Package perl-threads-shared.x86_64 0:1.43-6.el7 will be installed
[00:00:22] ---> Package python-deltarpm.x86_64 0:3.6-3.el7 will be installed
[00:00:22] ---> Package python-kitchen.noarch 0:1.1.1-5.el7 will be installed
[00:00:22] --> Processing Dependency: python-chardet for package: python-kitchen-1.1.1-5.el7.noarch
[00:00:22] ---> Package redhat-rpm-config.noarch 0:9.1.0-87.el7.centos will be installed
[00:00:22] --> Processing Dependency: dwz >= 0.4 for package: redhat-rpm-config-9.1.0-87.el7.centos.noarch
[00:00:22] --> Processing Dependency: zip for package: redhat-rpm-config-9.1.0-87.el7.centos.noarch
[00:00:22] --> Processing Dependency: perl-srpm-macros for package: redhat-rpm-config-9.1.0-87.el7.centos.noarch
[00:00:22] ---> Package unzip.x86_64 0:6.0-19.el7 will be installed
[00:00:22] --> Running transaction check
[00:00:22] ---> Package dwz.x86_64 0:0.11-3.el7 will be installed
[00:00:22] ---> Package glibc.x86_64 0:2.17-260.el7 will be updated
[00:00:22] --> Processing Dependency: glibc = 2.17-260.el7 for package: glibc-common-2.17-260.el7.x86_64
[00:00:22] ---> Package glibc.x86_64 0:2.17-260.el7_6.3 will be an update
[00:00:22] ---> Package glibc-headers.x86_64 0:2.17-260.el7_6.3 will be installed
[00:00:22] --> Processing Dependency: kernel-headers >= 2.2.1 for package: glibc-headers-2.17-260.el7_6.3.x86_64
[00:00:22] --> Processing Dependency: kernel-headers for package: glibc-headers-2.17-260.el7_6.3.x86_64
[00:00:22] ---> Package perl-Encode.x86_64 0:2.51-7.el7 will be installed
[00:00:22] ---> Package perl-Pod-Escapes.noarch 1:1.04-294.el7_6 will be installed
[00:00:22] ---> Package perl-Pod-Usage.noarch 0:1.63-3.el7 will be installed
[00:00:22] --> Processing Dependency: perl(Pod::Text) >= 3.15 for package: perl-Pod-Usage-1.63-3.el7.noarch
[00:00:22] --> Processing Dependency: perl-Pod-Perldoc for package: perl-Pod-Usage-1.63-3.el7.noarch
[00:00:22] ---> Package perl-Text-ParseWords.noarch 0:3.29-4.el7 will be installed
[00:00:22] ---> Package perl-srpm-macros.noarch 0:1-8.el7 will be installed
[00:00:22] ---> Package python-chardet.noarch 0:2.2.1-1.el7_1 will be installed
[00:00:23] ---> Package zip.x86_64 0:3.0-11.el7 will be installed
[00:00:23] --> Running transaction check
[00:00:23] ---> Package glibc-common.x86_64 0:2.17-260.el7 will be updated
[00:00:23] ---> Package glibc-common.x86_64 0:2.17-260.el7_6.3 will be an update
[00:00:23] ---> Package kernel-headers.x86_64 0:3.10.0-957.5.1.el7 will be installed
[00:00:23] ---> Package perl-Pod-Perldoc.noarch 0:3.20-4.el7 will be installed
[00:00:23] --> Processing Dependency: perl(parent) for package: perl-Pod-Perldoc-3.20-4.el7.noarch
[00:00:23] --> Processing Dependency: perl(HTTP::Tiny) for package: perl-Pod-Perldoc-3.20-4.el7.noarch
[00:00:23] --> Processing Dependency: groff-base for package: perl-Pod-Perldoc-3.20-4.el7.noarch
[00:00:23] ---> Package perl-podlators.noarch 0:2.5.1-3.el7 will be installed
[00:00:23] --> Running transaction check
[00:00:23] ---> Package groff-base.x86_64 0:1.22.2-8.el7 will be installed
[00:00:23] ---> Package perl-HTTP-Tiny.noarch 0:0.033-3.el7 will be installed
[00:00:23] ---> Package perl-parent.noarch 1:0.225-244.el7 will be installed
[00:00:23] --> Finished Dependency Resolution
[00:00:23] 
[00:00:23] Dependencies Resolved
[00:00:23] 
[00:00:23] ================================================================================
[00:00:23]  Package                   Arch      Version                   Repository  Size
[00:00:23] ================================================================================
[00:00:23] Installing:
[00:00:23]  createrepo                noarch    0.9.9-28.el7              base        94 k
[00:00:23]  gcc                       x86_64    4.8.5-36.el7              base        16 M
[00:00:23]  make                      x86_64    1:3.82-23.el7             base       420 k
[00:00:23]  perl                      x86_64    4:5.16.3-294.el7_6        updates    8.0 M
[00:00:23]  rpm-build                 x86_64    4.11.3-35.el7             base       147 k
[00:00:23]  rpm-sign                  x86_64    4.11.3-35.el7             base        48 k
[00:00:23]  rsync                     x86_64    3.1.2-4.el7               base       403 k
[00:00:23]  yum-plugin-priorities     noarch    1.1.31-50.el7             base        29 k
[00:00:23]  yum-utils                 noarch    1.1.31-50.el7             base       121 k
[00:00:23] Installing for dependencies:
[00:00:23]  bzip2                     x86_64    1.0.6-13.el7              base        52 k
[00:00:23]  cpp                       x86_64    4.8.5-36.el7              base       5.9 M
[00:00:23]  deltarpm                  x86_64    3.6-3.el7                 base        82 k
[00:00:23]  dwz                       x86_64    0.11-3.el7                base        99 k
[00:00:23]  elfutils                  x86_64    0.172-2.el7               base       299 k
[00:00:23]  file                      x86_64    5.11-35.el7               base        57 k
[00:00:23]  gdb                       x86_64    7.6.1-114.el7             base       2.4 M
[00:00:23]  glibc-devel               x86_64    2.17-260.el7_6.3          updates    1.1 M
[00:00:23]  glibc-headers             x86_64    2.17-260.el7_6.3          updates    683 k
[00:00:23]  groff-base                x86_64    1.22.2-8.el7              base       942 k
[00:00:23]  kernel-headers            x86_64    3.10.0-957.5.1.el7        updates    8.0 M
[00:00:23]  libgomp                   x86_64    4.8.5-36.el7              base       157 k
[00:00:23]  libmpc                    x86_64    1.0.1-3.el7               base        51 k
[00:00:23]  libxml2-python            x86_64    2.9.1-6.el7_2.3           base       247 k
[00:00:23]  mpfr                      x86_64    3.1.1-4.el7               base       203 k
[00:00:23]  patch                     x86_64    2.7.1-10.el7_5            base       110 k
[00:00:23]  perl-Carp                 noarch    1.26-244.el7              base        19 k
[00:00:23]  perl-Encode               x86_64    2.51-7.el7                base       1.5 M
[00:00:23]  perl-Exporter             noarch    5.68-3.el7                base        28 k
[00:00:23]  perl-File-Path            noarch    2.09-2.el7                base        26 k
[00:00:23]  perl-File-Temp            noarch    0.23.01-3.el7             base        56 k
[00:00:23]  perl-Filter               x86_64    1.49-3.el7                base        76 k
[00:00:23]  perl-Getopt-Long          noarch    2.40-3.el7                base        56 k
[00:00:23]  perl-HTTP-Tiny            noarch    0.033-3.el7               base        38 k
[00:00:23]  perl-PathTools            x86_64    3.40-5.el7                base        82 k
[00:00:23]  perl-Pod-Escapes          noarch    1:1.04-294.el7_6          updates     51 k
[00:00:23]  perl-Pod-Perldoc          noarch    3.20-4.el7                base        87 k
[00:00:23]  perl-Pod-Simple           noarch    1:3.28-4.el7              base       216 k
[00:00:23]  perl-Pod-Usage            noarch    1.63-3.el7                base        27 k
[00:00:23]  perl-Scalar-List-Utils    x86_64    1.27-248.el7              base        36 k
[00:00:23]  perl-Socket               x86_64    2.010-4.el7               base        49 k
[00:00:23]  perl-Storable             x86_64    2.45-3.el7                base        77 k
[00:00:23]  perl-Text-ParseWords      noarch    3.29-4.el7                base        14 k
[00:00:23]  perl-Thread-Queue         noarch    3.02-2.el7                base        17 k
[00:00:23]  perl-Time-HiRes           x86_64    4:1.9725-3.el7            base        45 k
[00:00:23]  perl-Time-Local           noarch    1.2300-2.el7              base        24 k
[00:00:23]  perl-constant             noarch    1.27-2.el7                base        19 k
[00:00:23]  perl-libs                 x86_64    4:5.16.3-294.el7_6        updates    688 k
[00:00:23]  perl-macros               x86_64    4:5.16.3-294.el7_6        updates     44 k
[00:00:23]  perl-parent               noarch    1:0.225-244.el7           base        12 k
[00:00:23]  perl-podlators            noarch    2.5.1-3.el7               base       112 k
[00:00:23]  perl-srpm-macros          noarch    1-8.el7                   base       4.6 k
[00:00:23]  perl-threads              x86_64    1.87-4.el7                base        49 k
[00:00:23]  perl-threads-shared       x86_64    1.43-6.el7                base        39 k
[00:00:23]  python-chardet            noarch    2.2.1-1.el7_1             base       227 k
[00:00:23]  python-deltarpm           x86_64    3.6-3.el7                 base        31 k
[00:00:23]  python-kitchen            noarch    1.1.1-5.el7               base       267 k
[00:00:23]  redhat-rpm-config         noarch    9.1.0-87.el7.centos       base        81 k
[00:00:23]  unzip                     x86_64    6.0-19.el7                base       170 k
[00:00:23]  zip                       x86_64    3.0-11.el7                base       260 k
[00:00:23] Updating for dependencies:
[00:00:23]  glibc                     x86_64    2.17-260.el7_6.3          updates    3.7 M
[00:00:23]  glibc-common              x86_64    2.17-260.el7_6.3          updates     12 M
[00:00:23] 
[00:00:23] Transaction Summary
[00:00:23] ================================================================================
[00:00:23] Install  9 Packages (+50 Dependent packages)
[00:00:23] Upgrade             (  2 Dependent packages)
[00:00:23] 
[00:00:23] Total size: 65 M
[00:00:23] Downloading packages:
[00:00:23] Running transaction check
[00:00:23] Running transaction test
[00:00:23] Transaction test succeeded
[00:00:23] Running transaction
[00:00:27]   Updating   : glibc-2.17-260.el7_6.3.x86_64                               1/63 
[00:00:29]   Updating   : glibc-common-2.17-260.el7_6.3.x86_64                        2/63 
[00:00:30]   Installing : mpfr-3.1.1-4.el7.x86_64                                     3/63 
[00:00:30]   Installing : libmpc-1.0.1-3.el7.x86_64                                   4/63 
[00:00:30]   Installing : libxml2-python-2.9.1-6.el7_2.3.x86_64                       5/63 
[00:00:30]   Installing : deltarpm-3.6-3.el7.x86_64                                   6/63 
[00:00:30]   Installing : python-deltarpm-3.6-3.el7.x86_64                            7/63 
[00:00:30]   Installing : cpp-4.8.5-36.el7.x86_64                                     8/63 
[00:00:30]   Installing : unzip-6.0-19.el7.x86_64                                     9/63 
[00:00:31]   Installing : bzip2-1.0.6-13.el7.x86_64                                  10/63 
[00:00:31]   Installing : groff-base-1.22.2-8.el7.x86_64                             11/63 
[00:00:31]   Installing : 1:perl-parent-0.225-244.el7.noarch                         12/63 
[00:00:31]   Installing : perl-HTTP-Tiny-0.033-3.el7.noarch                          13/63 
[00:00:31]   Installing : perl-podlators-2.5.1-3.el7.noarch                          14/63 
[00:00:31]   Installing : perl-Pod-Perldoc-3.20-4.el7.noarch                         15/63 
[00:00:31]   Installing : 1:perl-Pod-Escapes-1.04-294.el7_6.noarch                   16/63 
[00:00:31]   Installing : perl-Text-ParseWords-3.29-4.el7.noarch                     17/63 
[00:00:31]   Installing : perl-Encode-2.51-7.el7.x86_64                              18/63 
[00:00:31]   Installing : perl-Pod-Usage-1.63-3.el7.noarch                           19/63 
[00:00:31]   Installing : perl-threads-1.87-4.el7.x86_64                             20/63 
[00:00:31]   Installing : 4:perl-Time-HiRes-1.9725-3.el7.x86_64                      21/63 
[00:00:31]   Installing : perl-Exporter-5.68-3.el7.noarch                            22/63 
[00:00:31]   Installing : perl-constant-1.27-2.el7.noarch                            23/63 
[00:00:31]   Installing : perl-Carp-1.26-244.el7.noarch                              24/63 
[00:00:31]   Installing : 4:perl-libs-5.16.3-294.el7_6.x86_64                        25/63 
[00:00:31]   Installing : perl-Time-Local-1.2300-2.el7.noarch                        26/63 
[00:00:31]   Installing : 4:perl-macros-5.16.3-294.el7_6.x86_64                      27/63 
[00:00:31]   Installing : perl-Socket-2.010-4.el7.x86_64                             28/63 
[00:00:31]   Installing : perl-Storable-2.45-3.el7.x86_64                            29/63 
[00:00:31]   Installing : perl-threads-shared-1.43-6.el7.x86_64                      30/63 
[00:00:31]   Installing : perl-PathTools-3.40-5.el7.x86_64                           31/63 
[00:00:31]   Installing : perl-Scalar-List-Utils-1.27-248.el7.x86_64                 32/63 
[00:00:31]   Installing : 1:perl-Pod-Simple-3.28-4.el7.noarch                        33/63 
[00:00:31]   Installing : perl-File-Temp-0.23.01-3.el7.noarch                        34/63 
[00:00:31]   Installing : perl-File-Path-2.09-2.el7.noarch                           35/63 
[00:00:31]   Installing : perl-Filter-1.49-3.el7.x86_64                              36/63 
[00:00:32]   Installing : perl-Getopt-Long-2.40-3.el7.noarch                         37/63 
[00:00:33]   Installing : 4:perl-5.16.3-294.el7_6.x86_64                             38/63 
[00:00:33]   Installing : perl-Thread-Queue-3.02-2.el7.noarch                        39/63 
[00:00:33]   Installing : dwz-0.11-3.el7.x86_64                                      40/63 
[00:00:33]   Installing : gdb-7.6.1-114.el7.x86_64                                   41/63 
[00:00:33]   Installing : file-5.11-35.el7.x86_64                                    42/63 
[00:00:33]   Installing : libgomp-4.8.5-36.el7.x86_64                                43/63 
[00:00:33]   Installing : zip-3.0-11.el7.x86_64                                      44/63 
[00:00:33]   Installing : patch-2.7.1-10.el7_5.x86_64                                45/63 
[00:00:33]   Installing : elfutils-0.172-2.el7.x86_64                                46/63 
[00:00:33]   Installing : python-chardet-2.2.1-1.el7_1.noarch                        47/63 
[00:00:33]   Installing : python-kitchen-1.1.1-5.el7.noarch                          48/63 
[00:00:33]   Installing : perl-srpm-macros-1-8.el7.noarch                            49/63 
[00:00:33]   Installing : redhat-rpm-config-9.1.0-87.el7.centos.noarch               50/63 
[00:00:34]   Installing : kernel-headers-3.10.0-957.5.1.el7.x86_64                   51/63 
[00:00:34]   Installing : glibc-headers-2.17-260.el7_6.3.x86_64                      52/63 
[00:00:35]   Installing : glibc-devel-2.17-260.el7_6.3.x86_64                        53/63 
[00:00:35]   Installing : gcc-4.8.5-36.el7.x86_64                                    54/63 
[00:00:35]   Installing : rpm-build-4.11.3-35.el7.x86_64                             55/63 
[00:00:35]   Installing : yum-utils-1.1.31-50.el7.noarch                             56/63 
[00:00:35]   Installing : createrepo-0.9.9-28.el7.noarch                             57/63 
[00:00:35]   Installing : rpm-sign-4.11.3-35.el7.x86_64                              58/63 
[00:00:35]   Installing : 1:make-3.82-23.el7.x86_64                                  59/63 
[00:00:35]   Installing : rsync-3.1.2-4.el7.x86_64                                   60/63 
[00:00:35]   Installing : yum-plugin-priorities-1.1.31-50.el7.noarch                 61/63 
[00:00:35]   Cleanup    : glibc-2.17-260.el7.x86_64                                  62/63 
[00:00:35]   Cleanup    : glibc-common-2.17-260.el7.x86_64                           63/63 
[00:00:35]   Verifying  : perl-HTTP-Tiny-0.033-3.el7.noarch                           1/63 
[00:00:35]   Verifying  : glibc-common-2.17-260.el7_6.3.x86_64                        2/63 
[00:00:35]   Verifying  : kernel-headers-3.10.0-957.5.1.el7.x86_64                    3/63 
[00:00:35]   Verifying  : rpm-build-4.11.3-35.el7.x86_64                              4/63 
[00:00:35]   Verifying  : perl-threads-shared-1.43-6.el7.x86_64                       5/63 
[00:00:35]   Verifying  : 4:perl-Time-HiRes-1.9725-3.el7.x86_64                       6/63 
[00:00:35]   Verifying  : 1:perl-Pod-Escapes-1.04-294.el7_6.noarch                    7/63 
[00:00:35]   Verifying  : perl-threads-1.87-4.el7.x86_64                              8/63 
[00:00:35]   Verifying  : perl-Exporter-5.68-3.el7.noarch                             9/63 
[00:00:35]   Verifying  : perl-constant-1.27-2.el7.noarch                            10/63 
[00:00:36]   Verifying  : perl-PathTools-3.40-5.el7.x86_64                           11/63 
[00:00:36]   Verifying  : perl-Pod-Perldoc-3.20-4.el7.noarch                         12/63 
[00:00:36]   Verifying  : perl-Carp-1.26-244.el7.noarch                              13/63 
[00:00:36]   Verifying  : unzip-6.0-19.el7.x86_64                                    14/63 
[00:00:36]   Verifying  : 1:perl-parent-0.225-244.el7.noarch                         15/63 
[00:00:36]   Verifying  : glibc-2.17-260.el7_6.3.x86_64                              16/63 
[00:00:36]   Verifying  : bzip2-1.0.6-13.el7.x86_64                                  17/63 
[00:00:36]   Verifying  : gcc-4.8.5-36.el7.x86_64                                    18/63 
[00:00:36]   Verifying  : yum-plugin-priorities-1.1.31-50.el7.noarch                 19/63 
[00:00:36]   Verifying  : 4:perl-libs-5.16.3-294.el7_6.x86_64                        20/63 
[00:00:36]   Verifying  : groff-base-1.22.2-8.el7.x86_64                             21/63 
[00:00:36]   Verifying  : perl-Thread-Queue-3.02-2.el7.noarch                        22/63 
[00:00:36]   Verifying  : perl-File-Temp-0.23.01-3.el7.noarch                        23/63 
[00:00:36]   Verifying  : 1:perl-Pod-Simple-3.28-4.el7.noarch                        24/63 
[00:00:36]   Verifying  : dwz-0.11-3.el7.x86_64                                      25/63 
[00:00:36]   Verifying  : perl-Time-Local-1.2300-2.el7.noarch                        26/63 
[00:00:36]   Verifying  : gdb-7.6.1-114.el7.x86_64                                   27/63 
[00:00:36]   Verifying  : perl-Text-ParseWords-3.29-4.el7.noarch                     28/63 
[00:00:36]   Verifying  : redhat-rpm-config-9.1.0-87.el7.centos.noarch               29/63 
[00:00:36]   Verifying  : perl-srpm-macros-1-8.el7.noarch                            30/63 
[00:00:36]   Verifying  : 4:perl-macros-5.16.3-294.el7_6.x86_64                      31/63 
[00:00:36]   Verifying  : perl-Socket-2.010-4.el7.x86_64                             32/63 
[00:00:36]   Verifying  : rpm-sign-4.11.3-35.el7.x86_64                              33/63 
[00:00:36]   Verifying  : glibc-devel-2.17-260.el7_6.3.x86_64                        34/63 
[00:00:36]   Verifying  : file-5.11-35.el7.x86_64                                    35/63 
[00:00:36]   Verifying  : cpp-4.8.5-36.el7.x86_64                                    36/63 
[00:00:36]   Verifying  : libgomp-4.8.5-36.el7.x86_64                                37/63 
[00:00:36]   Verifying  : libxml2-python-2.9.1-6.el7_2.3.x86_64                      38/63 
[00:00:36]   Verifying  : deltarpm-3.6-3.el7.x86_64                                  39/63 
[00:00:36]   Verifying  : perl-Storable-2.45-3.el7.x86_64                            40/63 
[00:00:36]   Verifying  : createrepo-0.9.9-28.el7.noarch                             41/63 
[00:00:36]   Verifying  : perl-Scalar-List-Utils-1.27-248.el7.x86_64                 42/63 
[00:00:36]   Verifying  : 1:make-3.82-23.el7.x86_64                                  43/63 
[00:00:36]   Verifying  : libmpc-1.0.1-3.el7.x86_64                                  44/63 
[00:00:36]   Verifying  : rsync-3.1.2-4.el7.x86_64                                   45/63 
[00:00:36]   Verifying  : perl-Pod-Usage-1.63-3.el7.noarch                           46/63 
[00:00:36]   Verifying  : glibc-headers-2.17-260.el7_6.3.x86_64                      47/63 
[00:00:36]   Verifying  : perl-Encode-2.51-7.el7.x86_64                              48/63 
[00:00:36]   Verifying  : yum-utils-1.1.31-50.el7.noarch                             49/63 
[00:00:36]   Verifying  : python-deltarpm-3.6-3.el7.x86_64                           50/63 
[00:00:36]   Verifying  : perl-File-Path-2.09-2.el7.noarch                           51/63 
[00:00:36]   Verifying  : zip-3.0-11.el7.x86_64                                      52/63 
[00:00:36]   Verifying  : mpfr-3.1.1-4.el7.x86_64                                    53/63 
[00:00:36]   Verifying  : perl-podlators-2.5.1-3.el7.noarch                          54/63 
[00:00:36]   Verifying  : python-chardet-2.2.1-1.el7_1.noarch                        55/63 
[00:00:36]   Verifying  : perl-Filter-1.49-3.el7.x86_64                              56/63 
[00:00:36]   Verifying  : perl-Getopt-Long-2.40-3.el7.noarch                         57/63 
[00:00:36]   Verifying  : python-kitchen-1.1.1-5.el7.noarch                          58/63 
[00:00:36]   Verifying  : 4:perl-5.16.3-294.el7_6.x86_64                             59/63 
[00:00:36]   Verifying  : patch-2.7.1-10.el7_5.x86_64                                60/63 
[00:00:36]   Verifying  : elfutils-0.172-2.el7.x86_64                                61/63 
[00:00:36]   Verifying  : glibc-2.17-260.el7.x86_64                                  62/63 
[00:00:36]   Verifying  : glibc-common-2.17-260.el7.x86_64                           63/63 
[00:00:36] 
[00:00:36] Installed:
[00:00:36]   createrepo.noarch 0:0.9.9-28.el7 gcc.x86_64 0:4.8.5-36.el7                   
[00:00:36]   make.x86_64 1:3.82-23.el7        perl.x86_64 4:5.16.3-294.el7_6              
[00:00:36]   rpm-build.x86_64 0:4.11.3-35.el7 rpm-sign.x86_64 0:4.11.3-35.el7             
[00:00:36]   rsync.x86_64 0:3.1.2-4.el7       yum-plugin-priorities.noarch 0:1.1.31-50.el7
[00:00:36]   yum-utils.noarch 0:1.1.31-50.el7
[00:00:36] 
[00:00:36] Dependency Installed:
[00:00:36]   bzip2.x86_64 0:1.0.6-13.el7                                                   
[00:00:36]   cpp.x86_64 0:4.8.5-36.el7                                                     
[00:00:36]   deltarpm.x86_64 0:3.6-3.el7                                                   
[00:00:36]   dwz.x86_64 0:0.11-3.el7                                                       
[00:00:36]   elfutils.x86_64 0:0.172-2.el7                                                 
[00:00:36]   file.x86_64 0:5.11-35.el7                                                     
[00:00:36]   gdb.x86_64 0:7.6.1-114.el7                                                    
[00:00:36]   glibc-devel.x86_64 0:2.17-260.el7_6.3                                         
[00:00:36]   glibc-headers.x86_64 0:2.17-260.el7_6.3                                       
[00:00:36]   groff-base.x86_64 0:1.22.2-8.el7                                              
[00:00:36]   kernel-headers.x86_64 0:3.10.0-957.5.1.el7                                    
[00:00:36]   libgomp.x86_64 0:4.8.5-36.el7                                                 
[00:00:36]   libmpc.x86_64 0:1.0.1-3.el7                                                   
[00:00:36]   libxml2-python.x86_64 0:2.9.1-6.el7_2.3                                       
[00:00:36]   mpfr.x86_64 0:3.1.1-4.el7                                                     
[00:00:36]   patch.x86_64 0:2.7.1-10.el7_5                                                 
[00:00:36]   perl-Carp.noarch 0:1.26-244.el7                                               
[00:00:36]   perl-Encode.x86_64 0:2.51-7.el7                                               
[00:00:36]   perl-Exporter.noarch 0:5.68-3.el7                                             
[00:00:36]   perl-File-Path.noarch 0:2.09-2.el7                                            
[00:00:36]   perl-File-Temp.noarch 0:0.23.01-3.el7                                         
[00:00:36]   perl-Filter.x86_64 0:1.49-3.el7                                               
[00:00:36]   perl-Getopt-Long.noarch 0:2.40-3.el7                                          
[00:00:36]   perl-HTTP-Tiny.noarch 0:0.033-3.el7                                           
[00:00:36]   perl-PathTools.x86_64 0:3.40-5.el7                                            
[00:00:36]   perl-Pod-Escapes.noarch 1:1.04-294.el7_6                                      
[00:00:36]   perl-Pod-Perldoc.noarch 0:3.20-4.el7                                          
[00:00:36]   perl-Pod-Simple.noarch 1:3.28-4.el7                                           
[00:00:36]   perl-Pod-Usage.noarch 0:1.63-3.el7                                            
[00:00:36]   perl-Scalar-List-Utils.x86_64 0:1.27-248.el7                                  
[00:00:36]   perl-Socket.x86_64 0:2.010-4.el7                                              
[00:00:36]   perl-Storable.x86_64 0:2.45-3.el7                                             
[00:00:36]   perl-Text-ParseWords.noarch 0:3.29-4.el7                                      
[00:00:36]   perl-Thread-Queue.noarch 0:3.02-2.el7                                         
[00:00:36]   perl-Time-HiRes.x86_64 4:1.9725-3.el7                                         
[00:00:36]   perl-Time-Local.noarch 0:1.2300-2.el7                                         
[00:00:36]   perl-constant.noarch 0:1.27-2.el7                                             
[00:00:36]   perl-libs.x86_64 4:5.16.3-294.el7_6                                           
[00:00:36]   perl-macros.x86_64 4:5.16.3-294.el7_6                                         
[00:00:36]   perl-parent.noarch 1:0.225-244.el7                                            
[00:00:36]   perl-podlators.noarch 0:2.5.1-3.el7                                           
[00:00:36]   perl-srpm-macros.noarch 0:1-8.el7                                             
[00:00:36]   perl-threads.x86_64 0:1.87-4.el7                                              
[00:00:36]   perl-threads-shared.x86_64 0:1.43-6.el7                                       
[00:00:36]   python-chardet.noarch 0:2.2.1-1.el7_1                                         
[00:00:36]   python-deltarpm.x86_64 0:3.6-3.el7                                            
[00:00:36]   python-kitchen.noarch 0:1.1.1-5.el7                                           
[00:00:36]   redhat-rpm-config.noarch 0:9.1.0-87.el7.centos                                
[00:00:36]   unzip.x86_64 0:6.0-19.el7                                                     
[00:00:36]   zip.x86_64 0:3.0-11.el7                                                       
[00:00:36] 
[00:00:36] Dependency Updated:
[00:00:36]   glibc.x86_64 0:2.17-260.el7_6.3     glibc-common.x86_64 0:2.17-260.el7_6.3    
[00:00:36] 
[00:00:36] Complete!
[00:00:36] 0
[00:00:36] now running: ssh -f -o "StrictHostKeyChecking no" -o Port=22 -i /etc/lightbuildserver/container/container_rsa root@10.0.3.5 "export LC_ALL=C; (if [ -f /etc/yum.repos.d/CentOS-Sources.repo ]; then rm -Rf /etc/yum.repos.d/CentOS-Sources.repo; fi) 2>&1 && echo \$?"
[00:00:36] 0
[00:00:36] now running: ssh -f -o "StrictHostKeyChecking no" -o Port=22 -i /etc/lightbuildserver/container/container_rsa root@10.0.3.5 "export LC_ALL=C; (if [ -f /etc/yum.repos.d/CentOS-Vault.repo ]; then rm -Rf /etc/yum.repos.d/CentOS-Vault.repo; fi) 2>&1 && echo \$?"
[00:00:36] 0
[00:00:36] now running: ssh -f -o "StrictHostKeyChecking no" -o Port=22 -i /etc/lightbuildserver/container/container_rsa root@10.0.3.5 "export LC_ALL=C; (mkdir -p rpmbuild/{BUILD,RPMS,SOURCES,SPECS,SRPMS}) 2>&1 && echo \$?"
[00:00:36] 0
[00:00:36] now running: rsync -avz --delete -e "ssh -i /etc/lightbuildserver/container/container_rsa -p 2222" /var/lib/lightbuildserver/src/solidcharity/lbs-openpetra root@build04lxc.lbs.solidcharity.com:/var/lib/lxc/005-build04lxc.lbs.solidcharity.com/rootfs/root
[00:00:37] sending incremental file list
[00:00:37] lbs-openpetra/
[00:00:37] lbs-openpetra/config.yml
[00:00:37] lbs-openpetra/openpetranow-mysql-test -> openpetranow-mysql
[00:00:37] lbs-openpetra/codedoc/
[00:00:37] lbs-openpetra/codedoc/Dockerfile
[00:00:37] lbs-openpetra/codedoc/setup.sh
[00:00:37] lbs-openpetra/dbdoc/
[00:00:37] lbs-openpetra/dbdoc/Dockerfile
[00:00:37] lbs-openpetra/dbdoc/setup.sh
[00:00:37] lbs-openpetra/demodb/
[00:00:37] lbs-openpetra/demodb/setup.sh
[00:00:37] lbs-openpetra/manual/
[00:00:37] lbs-openpetra/manual/setup.sh
[00:00:37] lbs-openpetra/nightlydevzip/
[00:00:37] lbs-openpetra/nightlydevzip/github_uploadrelease.php
[00:00:37] lbs-openpetra/nightlydevzip/setup.sh
[00:00:37] lbs-openpetra/openpetra-test-client/
[00:00:37] lbs-openpetra/openpetra-test-client/setup.sh
[00:00:37] lbs-openpetra/openpetra-test-server-mysql/
[00:00:37] lbs-openpetra/openpetra-test-server-mysql/setup.sh
[00:00:37] lbs-openpetra/openpetra-test-server-postgresql/
[00:00:37] lbs-openpetra/openpetra-test-server-postgresql/setup.sh
[00:00:37] lbs-openpetra/openpetra-test-server-sqlite/
[00:00:37] lbs-openpetra/openpetra-test-server-sqlite/setup.sh
[00:00:37] lbs-openpetra/openpetranow-mysql/
[00:00:37] lbs-openpetra/openpetranow-mysql/Dockerfile.centos7
[00:00:37] lbs-openpetra/openpetranow-mysql/config.yml
[00:00:37] lbs-openpetra/openpetranow-mysql/openpetranow.spec
[00:00:37] lbs-openpetra/openpetranow-mysql/setup.sh
[00:00:37] lbs-openpetra/sql2diagram/
[00:00:37] lbs-openpetra/sql2diagram/config.yml
[00:00:37] lbs-openpetra/sql2diagram/sql2diagram.dsc
[00:00:37] lbs-openpetra/sql2diagram/sql2diagram.spec
[00:00:37] lbs-openpetra/sql2diagram/debian/
[00:00:37] lbs-openpetra/sql2diagram/debian/changelog
[00:00:37] lbs-openpetra/sql2diagram/debian/compat
[00:00:37] lbs-openpetra/sql2diagram/debian/control
[00:00:37] lbs-openpetra/sql2diagram/debian/rules
[00:00:37] 
[00:00:37] sent 16,735 bytes  received 535 bytes  34,540.00 bytes/sec
[00:00:37] total size is 36,170  speedup is 2.09
[00:00:37] now running: rsync -avz --delete -e "ssh -i /etc/lightbuildserver/container/container_rsa -p 2222" /etc/lightbuildserver/container/solidcharity/openpetra/* root@build04lxc.lbs.solidcharity.com:/var/lib/lxc/005-build04lxc.lbs.solidcharity.com/rootfs/root/.ssh
[00:00:37] sending incremental file list
[00:00:37] 0x3FA7E0328081BFF6A14DA29AA6A19B38D3D831EF.key
[00:00:37] distributions
[00:00:37] gitauth
[00:00:37] github_config.php
[00:00:37] gitkey
[00:00:37] id_rsa_cronjob
[00:00:37] id_rsa_cronjob.pub
[00:00:37] privateLBSkey
[00:00:37] rpmmacros
[00:00:37] 
[00:00:37] sent 8,528 bytes  received 187 bytes  5,810.00 bytes/sec
[00:00:37] total size is 10,351  speedup is 1.19
[00:00:37] now running: ssh -f -o "StrictHostKeyChecking no" -o Port=22 -i /etc/lightbuildserver/container/container_rsa root@10.0.3.5 "export LC_ALL=C; (chmod 600 /root/.ssh/*) 2>&1 && echo \$?"
[00:00:37] 0
[00:00:37] now running: ssh -f -o "StrictHostKeyChecking no" -o Port=22 -i /etc/lightbuildserver/container/container_rsa root@10.0.3.5 "export LC_ALL=C; (mkdir -p /root/sources) 2>&1 && echo \$?"
[00:00:37] 0
[00:00:37] now running: ssh -f -o "StrictHostKeyChecking no" -o Port=22 -i /etc/lightbuildserver/container/container_rsa root@10.0.3.5 "export LC_ALL=C; (curl -L https://github.com/openpetra/demo-databases/raw/master/base.yml.gz -o /root/sources/base.yml.gz) 2>&1 && echo \$?"
[00:00:37]   % Total    % Received % Xferd  Average Speed   Time    Time     Time  Current
[00:00:37]                                  Dload  Upload   Total   Spent    Left  Speed
[00:00:37] 
[00:00:38]   0     0    0     0    0     0      0      0 --:--:-- --:--:-- --:--:--     0
[00:00:38] 100   143  100   143    0     0    395      0 --:--:-- --:--:-- --:--:--   396
[00:00:38] 
[00:00:38]   0     0    0     0    0     0      0      0 --:--:-- --:--:-- --:--:--     0
[00:00:38] 100 46929  100 46929    0     0   103k      0 --:--:-- --:--:-- --:--:--  654k
[00:00:38] 0
[00:00:38] now running: ssh -f -o "StrictHostKeyChecking no" -o Port=22 -i /etc/lightbuildserver/container/container_rsa root@10.0.3.5 "export LC_ALL=C; (mkdir -p /root/sources) 2>&1 && echo \$?"
[00:00:38] 0
[00:00:38] now running: ssh -f -o "StrictHostKeyChecking no" -o Port=22 -i /etc/lightbuildserver/container/container_rsa root@10.0.3.5 "export LC_ALL=C; (curl -L https://github.com/openpetra/demo-databases/raw/master/clean.yml.gz -o /root/sources/clean.yml.gz) 2>&1 && echo \$?"
[00:00:38]   % Total    % Received % Xferd  Average Speed   Time    Time     Time  Current
[00:00:38]                                  Dload  Upload   Total   Spent    Left  Speed
[00:00:38] 
[00:00:38]   0     0    0     0    0     0      0      0 --:--:-- --:--:-- --:--:--     0
[00:00:38] 100   144  100   144    0     0    416      0 --:--:-- --:--:-- --:--:--   417
[00:00:39] 
[00:00:39] 100 32075  100 32075    0     0  81139      0 --:--:-- --:--:-- --:--:-- 81139
[00:00:39] 0
[00:00:39] now running: ssh -f -o "StrictHostKeyChecking no" -o Port=22 -i /etc/lightbuildserver/container/container_rsa root@10.0.3.5 "export LC_ALL=C; (if [ ! -f /etc/yum.repos.d/epel-release.repo ]; then exit -1; fi) 2>&1 && echo \$?"
[00:00:39] now running: ssh -f -o "StrictHostKeyChecking no" -o Port=22 -i /etc/lightbuildserver/container/container_rsa root@10.0.3.5 "export LC_ALL=C; (yum -y install epel-release) 2>&1 && echo \$?"
[00:00:39] Loaded plugins: fastestmirror, priorities
[00:00:39] Loading mirror speeds from cached hostfile
[00:00:39]  * base: ftp.plusline.net
[00:00:39]  * extras: mirror.ratiokontakt.de
[00:00:39]  * updates: mirror.fra10.de.leaseweb.net
[00:00:39] Resolving Dependencies
[00:00:39] --> Running transaction check
[00:00:39] ---> Package epel-release.noarch 0:7-11 will be installed
[00:00:39] --> Finished Dependency Resolution
[00:00:39] 
[00:00:39] Dependencies Resolved
[00:00:39] 
[00:00:39] ================================================================================
[00:00:39]  Package                Arch             Version         Repository        Size
[00:00:39] ================================================================================
[00:00:39] Installing:
[00:00:39]  epel-release           noarch           7-11            extras            15 k
[00:00:39] 
[00:00:39] Transaction Summary
[00:00:39] ================================================================================
[00:00:39] Install  1 Package
[00:00:39] 
[00:00:39] Total size: 15 k
[00:00:39] Installed size: 24 k
[00:00:39] Downloading packages:
[00:00:39] Running transaction check
[00:00:39] Running transaction test
[00:00:39] Transaction test succeeded
[00:00:39] Running transaction
[00:00:39]   Installing : epel-release-7-11.noarch                                     1/1 
[00:00:39]   Verifying  : epel-release-7-11.noarch                                     1/1 
[00:00:39] 
[00:00:39] Installed:
[00:00:39]   epel-release.noarch 0:7-11                                                    
[00:00:39] 
[00:00:39] Complete!
[00:00:39] 0
[00:00:39] now running: ssh -f -o "StrictHostKeyChecking no" -o Port=22 -i /etc/lightbuildserver/container/container_rsa root@10.0.3.5 "export LC_ALL=C; (if [ ! -f /etc/yum.repos.d/epel-testing.repo ]; then exit -1; fi) 2>&1 && echo \$?"
[00:00:40] 0
[00:00:40] now running: ssh -f -o "StrictHostKeyChecking no" -o Port=22 -i /etc/lightbuildserver/container/container_rsa root@10.0.3.5 "export LC_ALL=C; (yum-config-manager --enable epel-testing) 2>&1 && echo \$?"
[00:00:40] Loaded plugins: fastestmirror, priorities
[00:00:40] ============================== repo: epel-testing ==============================
[00:00:40] [epel-testing]
[00:00:40] async = True
[00:00:40] bandwidth = 0
[00:00:40] base_persistdir = /var/lib/yum/repos/x86_64/7
[00:00:40] baseurl = 
[00:00:40] cache = 0
[00:00:40] cachedir = /var/cache/yum/x86_64/7/epel-testing
[00:00:40] check_config_file_age = True
[00:00:40] compare_providers_priority = 80
[00:00:40] cost = 1000
[00:00:40] deltarpm_metadata_percentage = 100
[00:00:40] deltarpm_percentage = 
[00:00:40] enabled = 1
[00:00:40] enablegroups = True
[00:00:40] exclude = 
[00:00:40] failovermethod = priority
[00:00:40] ftp_disable_epsv = False
[00:00:40] gpgcadir = /var/lib/yum/repos/x86_64/7/epel-testing/gpgcadir
[00:00:40] gpgcakey = 
[00:00:40] gpgcheck = True
[00:00:40] gpgdir = /var/lib/yum/repos/x86_64/7/epel-testing/gpgdir
[00:00:40] gpgkey = file:///etc/pki/rpm-gpg/RPM-GPG-KEY-EPEL-7
[00:00:40] hdrdir = /var/cache/yum/x86_64/7/epel-testing/headers
[00:00:40] http_caching = all
[00:00:40] includepkgs = 
[00:00:40] ip_resolve = 
[00:00:40] keepalive = True
[00:00:40] keepcache = True
[00:00:40] mddownloadpolicy = sqlite
[00:00:40] mdpolicy = group:small
[00:00:40] mediaid = 
[00:00:40] metadata_expire = 21600
[00:00:40] metadata_expire_filter = read-only:present
[00:00:40] metalink = https://mirrors.fedoraproject.org/metalink?repo=testing-epel7&arch=x86_64
[00:00:40] minrate = 0
[00:00:40] mirrorlist = 
[00:00:40] mirrorlist_expire = 86400
[00:00:40] name = Extra Packages for Enterprise Linux 7 - Testing - x86_64
[00:00:40] old_base_cache_dir = 
[00:00:40] password = 
[00:00:40] persistdir = /var/lib/yum/repos/x86_64/7/epel-testing
[00:00:40] pkgdir = /var/cache/yum/x86_64/7/epel-testing/packages
[00:00:40] priority = 99
[00:00:40] proxy = False
[00:00:40] proxy_dict = 
[00:00:40] proxy_password = 
[00:00:40] proxy_username = 
[00:00:40] repo_gpgcheck = False
[00:00:40] retries = 10
[00:00:40] skip_if_unavailable = False
[00:00:40] ssl_check_cert_permissions = True
[00:00:40] sslcacert = 
[00:00:40] sslclientcert = 
[00:00:40] sslclientkey = 
[00:00:40] sslverify = True
[00:00:40] throttle = 0
[00:00:40] timeout = 30.0
[00:00:40] ui_id = epel-testing/x86_64
[00:00:40] ui_repoid_vars = releasever,
[00:00:40]    basearch
[00:00:40] username = 
[00:00:40] 
[00:00:40] 0
[00:00:40] now running: ssh -f -o "StrictHostKeyChecking no" -o Port=22 -i /etc/lightbuildserver/container/container_rsa root@10.0.3.5 "export LC_ALL=C; (cd /etc/yum.repos.d/; curl -L https://copr.fedorainfracloud.org/coprs/tpokorra/mono-5.18/repo/epel-7/tpokorra-mono-5.18-epel-7.repo -o `basename https://copr.fedorainfracloud.org/coprs/tpokorra/mono-5.18/repo/epel-7/tpokorra-mono-5.18-epel-7.repo`) 2>&1 && echo \$?"
[00:00:40]   % Total    % Received % Xferd  Average Speed   Time    Time     Time  Current
[00:00:40]                                  Dload  Upload   Total   Spent    Left  Speed
[00:00:40] 
[00:00:41]   0     0    0     0    0     0      0      0 --:--:-- --:--:-- --:--:--     0
[00:00:41] 100   338  100   338    0     0    465      0 --:--:-- --:--:-- --:--:--   465
[00:00:41] 100   338  100   338    0     0    465      0 --:--:-- --:--:-- --:--:--   465
[00:00:41] 0
[00:00:41] now running: rsync -avz --delete -e "ssh -i /etc/lightbuildserver/container/container_rsa -p 2222" /var/lib/lightbuildserver/repos/solidcharity/openpetra/centos/7/lbs-solidcharity-openpetra.repo root@build04lxc.lbs.solidcharity.com:/var/lib/lxc/005-build04lxc.lbs.solidcharity.com/rootfs/etc/yum.repos.d
[00:00:41] sending incremental file list
[00:00:41] lbs-solidcharity-openpetra.repo
[00:00:41] 
[00:00:41] sent 236 bytes  received 35 bytes  180.67 bytes/sec
[00:00:41] total size is 157  speedup is 0.58
[00:00:41] now running: ssh -f -o "StrictHostKeyChecking no" -o Port=22 -i /etc/lightbuildserver/container/container_rsa root@10.0.3.5 "export LC_ALL=C; (echo "priority = 60" >> /etc/yum.repos.d/lbs-solidcharity-openpetra.repo) 2>&1 && echo \$?"
[00:00:41] 0
[00:00:41] now running: ssh -f -o "StrictHostKeyChecking no" -o Port=22 -i /etc/lightbuildserver/container/container_rsa root@10.0.3.5 "export LC_ALL=C; (yum clean metadata) 2>&1 && echo \$?"
[00:00:41] Loaded plugins: fastestmirror, priorities
[00:00:42] Cleaning repos: base epel epel-testing extras lbs-solidcharity-openpetra
[00:00:42]               : tpokorra-mono-5.18 updates
[00:00:42] 24 metadata files removed
[00:00:42] 14 sqlite files removed
[00:00:42] 0 metadata files removed
[00:00:42] 0
[00:00:42] now running: ssh -f -o "StrictHostKeyChecking no" -o Port=22 -i /etc/lightbuildserver/container/container_rsa root@10.0.3.5 "export LC_ALL=C; (cd lbs-openpetra/openpetranow-mysql-test; ./setup.sh test) 2>&1 && echo \$?"
[00:00:42] Loaded plugins: fastestmirror, priorities
[00:00:42] Loading mirror speeds from cached hostfile
[00:00:46]  * base: ftp.plusline.net
[00:00:46]  * epel: ftp.plusline.net
[00:00:46]  * epel-testing: ftp.plusline.net
[00:00:46]  * extras: centosmirror.netcup.net
[00:00:46]  * updates: mirror.ratiokontakt.de
[00:00:53] Resolving Dependencies
[00:00:53] --> Running transaction check
[00:00:53] ---> Package wget.x86_64 0:1.14-18.el7 will be installed
[00:00:53] --> Finished Dependency Resolution
[00:00:53] 
[00:00:53] Dependencies Resolved
[00:00:53] 
[00:00:53] ================================================================================
[00:00:53]  Package         Arch              Version                Repository       Size
[00:00:53] ================================================================================
[00:00:53] Installing:
[00:00:53]  wget            x86_64            1.14-18.el7            base            547 k
[00:00:53] 
[00:00:53] Transaction Summary
[00:00:53] ================================================================================
[00:00:53] Install  1 Package
[00:00:53] 
[00:00:53] Total size: 547 k
[00:00:53] Installed size: 2.0 M
[00:00:53] Downloading packages:
[00:00:53] Running transaction check
[00:00:53] Running transaction test
[00:00:53] Transaction test succeeded
[00:00:53] Running transaction
[00:00:53]   Installing : wget-1.14-18.el7.x86_64                                      1/1 
[00:00:53]   Verifying  : wget-1.14-18.el7.x86_64                                      1/1 
[00:00:53] 
[00:00:53] Installed:
[00:00:53]   wget.x86_64 0:1.14-18.el7                                                     
[00:00:53] 
[00:00:53] Complete!
[00:00:54] 
[00:00:54] ## Installing the NodeSource Node.js 8.x LTS Carbon repo...
[00:00:54] 
[00:00:54] 
[00:00:54] ## Inspecting system...
[00:00:54] 
[00:00:54] + rpm -q --whatprovides redhat-release || rpm -q --whatprovides centos-release || rpm -q --whatprovides cloudlinux-release || rpm -q --whatprovides sl-release
[00:00:54] + uname -m
[00:00:54] 
[00:00:54] ## Confirming "el7-x86_64" is supported...
[00:00:54] 
[00:00:54] + curl -sLf -o /dev/null 'https://rpm.nodesource.com/pub_8.x/el/7/x86_64/nodesource-release-el7-1.noarch.rpm'
[00:00:54] 
[00:00:54] ## Downloading release setup RPM...
[00:00:54] 
[00:00:54] + mktemp
[00:00:54] + curl -sL -o '/tmp/tmp.mn901qQKXM' 'https://rpm.nodesource.com/pub_8.x/el/7/x86_64/nodesource-release-el7-1.noarch.rpm'
[00:00:54] 
[00:00:54] ## Installing release setup RPM...
[00:00:54] 
[00:00:54] + rpm -i --nosignature --force '/tmp/tmp.mn901qQKXM'
[00:00:54] 
[00:00:54] ## Cleaning up...
[00:00:54] 
[00:00:54] + rm -f '/tmp/tmp.mn901qQKXM'
[00:00:54] 
[00:00:54] ## Checking for existing installations...
[00:00:54] 
[00:00:54] + rpm -qa 'node|npm' | grep -v nodesource
[00:00:54] 
[00:00:54] ## Run `sudo yum install -y nodejs` to install Node.js 8.x LTS Carbon and npm.
[00:00:54] ## You may also need development tools to build native addons:
[00:00:54]      sudo yum install gcc-c++ make
[00:00:54] ## To install the Yarn package manager, run:
[00:00:54]      curl -sL https://dl.yarnpkg.com/rpm/yarn.repo | sudo tee /etc/yum.repos.d/yarn.repo
[00:00:54]      sudo yum install yarn
[00:00:54] 
[00:00:54] Loaded plugins: fastestmirror, priorities
[00:00:54] Loading mirror speeds from cached hostfile
[00:00:58]  * base: ftp.plusline.net
[00:00:58]  * epel: ftp.plusline.net
[00:00:58]  * epel-testing: ftp.plusline.net
[00:00:58]  * extras: centosmirror.netcup.net
[00:00:58]  * updates: mirror.ratiokontakt.de
[00:01:00] Resolving Dependencies
[00:01:00] --> Running transaction check
[00:01:00] ---> Package nodejs.x86_64 2:8.15.0-1nodesource will be installed
[00:01:00] --> Finished Dependency Resolution
[00:01:00] 
[00:01:00] Dependencies Resolved
[00:01:01] 
[00:01:01] ================================================================================
[00:01:01]  Package      Arch         Version                       Repository        Size
[00:01:01] ================================================================================
[00:01:01] Installing:
[00:01:01]  nodejs       x86_64       2:8.15.0-1nodesource          nodesource        16 M
[00:01:01] 
[00:01:01] Transaction Summary
[00:01:01] ================================================================================
[00:01:01] Install  1 Package
[00:01:01] 
[00:01:01] Total size: 16 M
[00:01:01] Installed size: 49 M
[00:01:01] Downloading packages:
[00:01:01] warning: /var/cache/yum/x86_64/7/nodesource/packages/nodejs-8.15.0-1nodesource.x86_64.rpm: Header V4 RSA/SHA256 Signature, key ID 34fa74dd: NOKEY
[00:01:01] Retrieving key from file:///etc/pki/rpm-gpg/NODESOURCE-GPG-SIGNING-KEY-EL
[00:01:01] Importing GPG key 0x34FA74DD:
[00:01:01]  Userid     : "NodeSource <gpg-rpm@nodesource.com>"
[00:01:01]  Fingerprint: 2e55 207a 95d9 944b 0cc9 3261 5ddb e8d4 34fa 74dd
[00:01:01]  Package    : nodesource-release-el7-1.noarch (installed)
[00:01:01]  From       : /etc/pki/rpm-gpg/NODESOURCE-GPG-SIGNING-KEY-EL
[00:01:01] Running transaction check
[00:01:01] Running transaction test
[00:01:01] Transaction test succeeded
[00:01:01] Running transaction
[00:01:01] Warning: RPMDB altered outside of yum.
[00:01:02]   Installing : 2:nodejs-8.15.0-1nodesource.x86_64                           1/1 
[00:01:02]   Verifying  : 2:nodejs-8.15.0-1nodesource.x86_64                           1/1 
[00:01:02] 
[00:01:02] Installed:
[00:01:02]   nodejs.x86_64 2:8.15.0-1nodesource                                            
[00:01:02] 
[00:01:02] Complete!
[00:01:08] /usr/bin/browserify -> /usr/lib/node_modules/browserify/bin/cmd.js
[00:01:08] + browserify@16.2.3
[00:01:08] added 138 packages from 110 contributors in 4.778s
[00:01:09] /usr/bin/uglifyjs -> /usr/lib/node_modules/uglify-es/bin/uglifyjs
[00:01:09] + uglify-es@3.3.9
[00:01:09] added 3 packages from 38 contributors in 0.565s
[00:01:09] --2019-02-02 22:40:21--  https://github.com/openpetra/openpetra/archive/test.tar.gz
[00:01:09] Resolving github.com (github.com)... 140.82.118.3, 140.82.118.4
[00:01:09] Connecting to github.com (github.com)|140.82.118.3|:443... connected.
[00:01:09] HTTP request sent, awaiting response... 302 Found
[00:01:09] Location: https://codeload.github.com/openpetra/openpetra/tar.gz/test [following]
[00:01:09] --2019-02-02 22:40:21--  https://codeload.github.com/openpetra/openpetra/tar.gz/test
[00:01:09] Resolving codeload.github.com (codeload.github.com)... 192.30.253.121, 192.30.253.120
[00:01:09] Connecting to codeload.github.com (codeload.github.com)|192.30.253.121|:443... connected.
[00:01:10] HTTP request sent, awaiting response... 200 OK
[00:01:10] Length: unspecified [application/x-gzip]
[00:01:10] Saving to: 'sources.tar.gz'
[00:01:10] 
[00:01:10]      0K .......... .......... .......... .......... ..........  198K
[00:01:10]     50K .......... .......... .......... .......... ..........  643K
[00:01:10]    100K .......... .......... .......... .......... .......... 2.38M
[00:01:10]    150K .......... .......... .......... .......... ..........  670K
[00:01:10]    200K .......... .......... .......... .......... .......... 2.58M
[00:01:10]    250K .......... .......... .......... .......... .......... 11.4M
[00:01:10]    300K .......... .......... .......... .......... .......... 11.5M
[00:01:10]    350K .......... .......... .......... .......... .......... 11.2M
[00:01:10]    400K .......... .......... .......... .......... ..........  759K
[00:01:10]    450K .......... .......... .......... .......... .......... 2.70M
[00:01:10]    500K .......... .......... .......... .......... .......... 9.07M
[00:01:10]    550K .......... .......... .......... .......... .......... 12.5M
[00:01:10]    600K .......... .......... .......... .......... .......... 12.3M
[00:01:10]    650K .......... .......... .......... .......... .......... 13.4M
[00:01:10]    700K .......... .......... .......... .......... .......... 11.8M
[00:01:10]    750K .......... .......... .......... .......... .......... 12.9M
[00:01:10]    800K .......... .......... .......... .......... .......... 11.7M
[00:01:10]    850K .......... .......... .......... .......... .......... 1023K
[00:01:10]    900K .......... .......... .......... .......... .......... 2.97M
[00:01:10]    950K .......... .......... .......... .......... .......... 13.1M
[00:01:10]   1000K .......... .......... .......... .......... .......... 12.2M
[00:01:10]   1050K .......... .......... .......... .......... .......... 12.8M
[00:01:10]   1100K .......... .......... .......... .......... .......... 12.8M
[00:01:10]   1150K .......... .......... .......... .......... .......... 11.9M
[00:01:10]   1200K .......... .......... .......... .......... .......... 11.9M
[00:01:10]   1250K .......... .......... .......... .......... .......... 12.7M
[00:01:10]   1300K .......... .......... .......... .......... .......... 9.80M
[00:01:10]   1350K .......... .......... .......... .......... .......... 11.9M
[00:01:10]   1400K .......... .......... .......... .......... .......... 11.9M
[00:01:10]   1450K .......... .......... .......... .......... .......... 12.3M
[00:01:10]   1500K .......... .......... .......... .......... .......... 13.1M
[00:01:10]   1550K .......... .......... .......... .......... .......... 12.0M
[00:01:10]   1600K .......... .......... .......... .......... .......... 12.3M
[00:01:10]   1650K .......... .......... .......... .......... .......... 12.6M
[00:01:10]   1700K .......... .......... .......... .......... .......... 2.93M
[00:01:10]   1750K .......... .......... .......... .......... .......... 12.8M
[00:01:10]   1800K .......... .......... .......... .......... .......... 11.8M
[00:01:10]   1850K .......... .......... .......... .......... .......... 5.47M
[00:01:10]   1900K .......... .......... .......... .......... .......... 12.5M
[00:01:10]   1950K .......... .......... .......... .......... .......... 11.6M
[00:01:10]   2000K .......... .......... .......... .......... .......... 12.1M
[00:01:10]   2050K .......... .......... .......... .......... .......... 9.77M
[00:01:10]   2100K .......... .......... .......... .......... .......... 12.3M
[00:01:10]   2150K .......... .......... .......... .......... .......... 12.8M
[00:01:10]   2200K .......... .......... .......... .......... .......... 13.0M
[00:01:10]   2250K .......... .......... .......... .......... .......... 11.3M
[00:01:10]   2300K .......... .......... .......... .......... .......... 12.7M
[00:01:10]   2350K .......... .......... .......... .......... .......... 12.3M
[00:01:10]   2400K .......... .......... .......... .......... .......... 12.5M
[00:01:10]   2450K .......... .......... .......... .......... .......... 9.85M
[00:01:10]   2500K .......... .......... .......... .......... .......... 12.0M
[00:01:10]   2550K .......... .......... .......... .......... .......... 12.5M
[00:01:10]   2600K .......... .......... .......... .......... .......... 12.8M
[00:01:10]   2650K .......... .......... .......... .......... .......... 11.5M
[00:01:10]   2700K .......... .......... .......... .......... .......... 14.1M
[00:01:10]   2750K .......... .......... .......... .......... .......... 11.6M
[00:01:10]   2800K .......... .......... .......... .......... .......... 11.8M
[00:01:11]   2850K .......... .......... .......... .......... .......... 11.4M
[00:01:11]   2900K .......... .......... .......... .......... .......... 10.2M
[00:01:11]   2950K .......... .......... .......... .......... .......... 11.4M
[00:01:11]   3000K .......... .......... .......... .......... .......... 14.1M
[00:01:11]   3050K .......... .......... .......... .......... .......... 11.4M
[00:01:11]   3100K .......... .......... .......... .......... .......... 11.9M
[00:01:11]   3150K .......... .......... .......... .......... .......... 13.0M
[00:01:11]   3200K .......... .......... .......... .......... .......... 11.8M
[00:01:11]   3250K .......... .......... .......... .......... .......... 10.2M
[00:01:11]   3300K .......... .......... .......... .......... .......... 14.7M
[00:01:11]   3350K .......... .......... .......... .......... .......... 12.2M
[00:01:11]   3400K .......... .......... .......... .......... .......... 11.9M
[00:01:11]   3450K .......... .......... .......... .......... .......... 11.3M
[00:01:11]   3500K .......... .......... .......... .......... .......... 11.0M
[00:01:11]   3550K .......... .......... .......... .......... .......... 11.5M
[00:01:11]   3600K .......... .......... .......... .......... .......... 11.8M
[00:01:11]   3650K .......... .......... .......... .......... .......... 11.9M
[00:01:11]   3700K .......... .......... .......... .......... .......... 11.9M
[00:01:11]   3750K .......... .......... .......... .......... .......... 11.2M
[00:01:11]   3800K .......... .......... .......... .......... .......... 11.7M
[00:01:11]   3850K .......... .......... .......... .......... .......... 11.9M
[00:01:11]   3900K .......... .......... .......... .......... .......... 11.9M
[00:01:11]   3950K .......... .......... .......... .......... .......... 11.2M
[00:01:11]   4000K .......... .......... .......... .......... .......... 11.5M
[00:01:11]   4050K .......... .......... .......... .......... .......... 11.3M
[00:01:11]   4100K .......... .......... .......... .......... .......... 11.4M
[00:01:11]   4150K .......... .......... .......... .......... .......... 12.5M
[00:01:11]   4200K .......... .......... .......... .......... .......... 11.2M
[00:01:11]   4250K .......... .......... .......... .......... .......... 11.3M
[00:01:11]   4300K .......... .......... .......... .......... .......... 11.3M
[00:01:11]   4350K .......... .......... .......... .......... .......... 11.9M
[00:01:11]   4400K .......... .......... .......... .......... .......... 11.0M
[00:01:11]   4450K .......... .......... .......... .......... .......... 13.3M
[00:01:11]   4500K .......... .......... .......... .......... .......... 11.9M
[00:01:11]   4550K .......... .......... .......... .......... .......... 12.1M
[00:01:11]   4600K .......... .......... .......... .......... .......... 11.1M
[00:01:11]   4650K .......... .......... .......... .......... .......... 12.1M
[00:01:11]   4700K .......... .......... .......... .......... .......... 11.6M
[00:01:11]   4750K .......... .......... .......... .......... .......... 10.7M
[00:01:11]   4800K .......... .......... .......... .......... .......... 12.5M
[00:01:11]   4850K .......... .......... .......... .......... .......... 11.0M
[00:01:11]   4900K .......... .......... .......... .......... .......... 12.7M
[00:01:11]   4950K .......... .......... .......... .......... .......... 11.3M
[00:01:11]   5000K .......... .......... .......... .......... .......... 10.9M
[00:01:11]   5050K .......... .......... .......... .......... .......... 12.4M
[00:01:11]   5100K .......... .......... .......... .......... .......... 11.6M
[00:01:11]   5150K .......... .......... .......... .......... .......... 11.5M
[00:01:11]   5200K .......... .......... .......... .......... .......... 11.7M
[00:01:11]   5250K .......... .......... .......... .......... .......... 11.9M
[00:01:11]   5300K .......... .......... .......... .......... .......... 11.5M
[00:01:11]   5350K .......... .......... .......... .......... .......... 11.9M
[00:01:11]   5400K .......... .......... .......... .......... .......... 11.8M
[00:01:11]   5450K .......... .......... .......... .......... .......... 11.0M
[00:01:11]   5500K .......... .......... .......... .......... .......... 11.9M
[00:01:11]   5550K .......... .......... .......... .......... .......... 11.6M
[00:01:11]   5600K .......... .......... .......... .......... .......... 11.2M
[00:01:11]   5650K .......... .......... .......... .......... .......... 11.5M
[00:01:11]   5700K .......... .......... .......... .......... .......... 12.0M
[00:01:11]   5750K .......... .......... .......... .......... .......... 11.5M
[00:01:11]   5800K .......... .......... .......... .......... .......... 11.4M
[00:01:11]   5850K .......... .......... .......... .......... .......... 11.6M
[00:01:11]   5900K .......... .......... .......... .......... .......... 11.6M
[00:01:11]   5950K .......... .......... .......... .......... .......... 11.4M
[00:01:11]   6000K .......... .......... .......... .......... .......... 11.5M
[00:01:11]   6050K .......... .......... .......... .......... .......... 11.9M
[00:01:11]   6100K .......... .......... .......... .......... .......... 10.2M
[00:01:11]   6150K .......... .......... .......... .......... .......... 13.6M
[00:01:11]   6200K .......... .......... .......... .......... .......... 11.2M
[00:01:11]   6250K .......... .......... .......... .......... .......... 11.1M
[00:01:11]   6300K .......... .......... .......... .......... .......... 12.1M
[00:01:11]   6350K .......... .......... .......... .......... .......... 12.0M
[00:01:11]   6400K .......... .......... .......... .......... .......... 11.1M
[00:01:11]   6450K .......... .......... .......... .......... .......... 12.0M
[00:01:11]   6500K .......... .......... .......... .......... .......... 9.50M
[00:01:11]   6550K .......... .......... .......... .......... .......... 13.0M
[00:01:11]   6600K .......... .......... .......... .......... .......... 13.2M
[00:01:11]   6650K .......... .......... .......... .......... .......... 11.4M
[00:01:11]   6700K .......... .......... .......... .......... .......... 11.3M
[00:01:11]   6750K .......... .......... .......... .......... .......... 11.9M
[00:01:11]   6800K .......... .......... .......... .......... .......... 11.4M
[00:01:11]   6850K .......... .......... .......... .......... .......... 11.8M
[00:01:11]   6900K .......... .......... .......... .......... .......... 11.5M
[00:01:11]   6950K .......... .......... .......... .......... .......... 13.4M
[00:01:11]   7000K .......... .......... .......... .......... .......... 9.83M
[00:01:11]   7050K .......... .......... .......... .......... .......... 12.1M
[00:01:11]   7100K .......... .......... .......... .......... .......... 11.1M
[00:01:11]   7150K .......... .......... .......... .......... .......... 10.4M
[00:01:11]   7200K .......... .......... .......... .......... .......... 10.4M
[00:01:11]   7250K .......... .......... .......... .......... .......... 13.8M
[00:01:11]   7300K .......... .......... .......... .......... .......... 11.3M
[00:01:11]   7350K .......... .......... .......... .......... .......... 14.1M
[00:01:11]   7400K .......... .......... .......... .......... .......... 11.8M
[00:01:11]   7450K .......... .......... .......... .......... .......... 11.5M
[00:01:11]   7500K .......... .......... .......... .......... .......... 11.4M
[00:01:11]   7550K .......... .......... .......... .......... .......... 11.8M
[00:01:11]   7600K .......... .......... .......... .......... .......... 11.2M
[00:01:11]   7650K .......... .......... .......... .......... .......... 12.1M
[00:01:11]   7700K .......... .......... .......... .......... .......... 11.5M
[00:01:11]   7750K .......... .......... .......... .......... .......... 12.1M
[00:01:11]   7800K .......... .......... .......... .......... .......... 11.3M
[00:01:11]   7850K .......... .......... .......... .......... .......... 11.6M
[00:01:11]   7900K .......... .......... .......... .......... .......... 12.0M
[00:01:11]   7950K .......... .......... .......... .......... .......... 11.3M
[00:01:11]   8000K .......... .......... .......... .......... .......... 11.5M
[00:01:11]   8050K .......... .......... .......... .......... .......... 11.9M
[00:01:11]   8100K .......... .......... .......... .......... .......... 11.6M
[00:01:11]   8150K .......... .......... .......... .......... .......... 11.8M
[00:01:11]   8200K .......... .......... .......... .......... .......... 11.8M
[00:01:11]   8250K .......... .......... .......... .......... .......... 11.3M
[00:01:11]   8300K .......... .......... .......... .......... .......... 11.5M
[00:01:11]   8350K .......... .......... .......... .......... .......... 12.4M
[00:01:11]   8400K .......... .......... .......... .......... .......... 10.7M
[00:01:11]   8450K .......... .......... .......... .......... .......... 12.2M
[00:01:11]   8500K .......... .......... .......... .......... .......... 11.3M
[00:01:11]   8550K .......... .......... .......... .......... .......... 11.9M
[00:01:11]   8600K .......... .......... .......... .......... .......... 11.3M
[00:01:11]   8650K .......... .......... .......... .......... .......... 12.0M
[00:01:11]   8700K .......... .......... .......... .......... .......... 11.0M
[00:01:11]   8750K .......... .......... .......... .......... .......... 11.8M
[00:01:11]   8800K .......... .......... .......... .......... .......... 11.6M
[00:01:11]   8850K .......... .......... .......... .......... .......... 11.6M
[00:01:11]   8900K .......... .......... .......... .......... .......... 11.9M
[00:01:11]   8950K .......... .......... .......... .......... .......... 11.9M
[00:01:11]   9000K .......... .......... .......... .......... .......... 11.1M
[00:01:11]   9050K .......... .......... .......... .......... .......... 11.6M
[00:01:11]   9100K .......... .......... .......... .......... .......... 11.5M
[00:01:11]   9150K .......... .......... .......... .......... .......... 11.8M
[00:01:11]   9200K .......... .......... .......... .......... .......... 11.6M
[00:01:11]   9250K .......... .......... .......... .......... .......... 11.7M
[00:01:11]   9300K .......... .......... .......... .......... .......... 11.7M
[00:01:11]   9350K .......... .......... .......... .......... .......... 11.6M
[00:01:11]   9400K .......... .......... .......... .......... .......... 11.3M
[00:01:11]   9450K .......... .......... .......... .......... .......... 11.4M
[00:01:11]   9500K .......... .......... .......... .......... .......... 11.8M
[00:01:11]   9550K .......... .......... .......... .......... .......... 11.8M
[00:01:11]   9600K .......... .......... .......... .......... .......... 11.2M
[00:01:11]   9650K .......... .......... .......... .......... .......... 12.1M
[00:01:11]   9700K .......... .......... .......... .......... .......... 11.1M
[00:01:11]   9750K .......... .......... .......... .......... .......... 11.8M
[00:01:11]   9800K .......... .......... .......... .......... .......... 11.4M
[00:01:11]   9850K .......... .......... .......... .......... .......... 11.7M
[00:01:11]   9900K .......... .......... .......... .......... .......... 11.4M
[00:01:11]   9950K .......... .......... .......... .......... .......... 11.5M
[00:01:11]  10000K .......... .......... .......... .......... .......... 11.6M
[00:01:11]  10050K .......... .......... .......... .......... .......... 12.0M
[00:01:11]  10100K .......... .......... .......... .......... .......... 11.2M
[00:01:11]  10150K .......... .......... .......... .......... .......... 12.0M
[00:01:11]  10200K .......... .......... .......... .......... .......... 11.5M
[00:01:11]  10250K .......... .......... .......... .......... .......... 11.7M
[00:01:11]  10300K .......... .......... .......... .......... .......... 11.4M
[00:01:11]  10350K .......... .......... .......... .......... .......... 11.4M
[00:01:11]  10400K .......... .......... .......... .......... .......... 11.6M
[00:01:11]  10450K .......... .......... .......... .......... .......... 11.7M
[00:01:11]  10500K .......... .......... .......... .......... .......... 11.6M
[00:01:11]  10550K .......... .......... .......... .......... .......... 11.9M
[00:01:11]  10600K .......... .......... .......... .......... .......... 11.5M
[00:01:11]  10650K .......... .......... .......... .......... .......... 11.6M
[00:01:11]  10700K .......... .......... .......... .......... .......... 11.5M
[00:01:11]  10750K .......... .......... .......... .......... .......... 11.4M
[00:01:11]  10800K .......... .......... .......... .......... .......... 11.7M
[00:01:11]  10850K .......... .......... .......... .......... .......... 12.0M
[00:01:11]  10900K .......... .......... .......... .......... .......... 11.4M
[00:01:11]  10950K .......... .......... .......... .......... .......... 11.6M
[00:01:11]  11000K .......... .......... .......... .......... .......... 11.4M
[00:01:11]  11050K .......... .......... .......... .......... .......... 11.7M
[00:01:11]  11100K .......... .......... .......... .......... .......... 11.3M
[00:01:11]  11150K .......... .......... .......... .......... .......... 12.3M
[00:01:11]  11200K .......... .......... .......... .......... .......... 11.0M
[00:01:11]  11250K .......... .......... .......... .......... .......... 11.8M
[00:01:11]  11300K .......... .......... .......... .......... .......... 11.7M
[00:01:11]  11350K .......... .......... .......... .......... .......... 11.4M
[00:01:11]  11400K .......... .......... .......... .......... .......... 11.4M
[00:01:11]  11450K .......... .......... .......... .......... .......... 11.6M
[00:01:11]  11500K .......... .......... .......... .......... .......... 11.7M
[00:01:11]  11550K .......... .......... .......... .......... .......... 11.9M
[00:01:11]  11600K .......... .......... .......... .......... .......... 10.9M
[00:01:11]  11650K .......... .......... .......... .......... .......... 12.2M
[00:01:11]  11700K .......... .......... .......... .......... .......... 11.3M
[00:01:11]  11750K .......... .                                           11.4M=1.6s
[00:01:11] 
[00:01:11] 2019-02-02 22:40:23 (7.39 MB/s) - 'sources.tar.gz' saved [12043655]
[00:01:11] 
[00:01:11] --2019-02-02 22:40:23--  https://github.com/openpetra/openpetra-client-js/archive/test.tar.gz
[00:01:11] Resolving github.com (github.com)... 140.82.118.4, 140.82.118.3
[00:01:11] Connecting to github.com (github.com)|140.82.118.4|:443... connected.
[00:01:11] HTTP request sent, awaiting response... 302 Found
[00:01:11] Location: https://codeload.github.com/openpetra/openpetra-client-js/tar.gz/test [following]
[00:01:11] --2019-02-02 22:40:23--  https://codeload.github.com/openpetra/openpetra-client-js/tar.gz/test
[00:01:11] Resolving codeload.github.com (codeload.github.com)... 192.30.253.120, 192.30.253.121
[00:01:12] Connecting to codeload.github.com (codeload.github.com)|192.30.253.120|:443... connected.
[00:01:12] HTTP request sent, awaiting response... 200 OK
[00:01:12] Length: unspecified [application/x-gzip]
[00:01:12] Saving to: 'sources-client.tar.gz'
[00:01:12] 
[00:01:12]      0K .......... .......... .......... .......... ..........  241K
[00:01:12]     50K .......... .......... .......... .........              942K=0.2s
[00:01:12] 
[00:01:12] 2019-02-02 22:40:24 (359 KB/s) - 'sources-client.tar.gz' saved [91684]
[00:01:12] 
[00:01:18] added 223 packages from 172 contributors and audited 1034 packages in 5.77s
[00:01:18] found 0 vulnerabilities
[00:01:18] 
[00:01:22] audited 1034 packages in 2.741s
[00:01:22] found 0 vulnerabilities
[00:01:22] 
[00:01:22] /root/lbs-openpetra/openpetranow-mysql-test
[00:01:23] --2019-02-02 22:40:34--  https://github.com/openpetra/openpetra-i18n/archive/master.tar.gz
[00:01:23] Resolving github.com (github.com)... 140.82.118.3, 140.82.118.4
[00:01:23] Connecting to github.com (github.com)|140.82.118.3|:443... connected.
[00:01:23] HTTP request sent, awaiting response... 302 Found
[00:01:23] Location: https://codeload.github.com/openpetra/openpetra-i18n/tar.gz/master [following]
[00:01:23] --2019-02-02 22:40:35--  https://codeload.github.com/openpetra/openpetra-i18n/tar.gz/master
[00:01:23] Resolving codeload.github.com (codeload.github.com)... 192.30.253.121, 192.30.253.120
[00:01:23] Connecting to codeload.github.com (codeload.github.com)|192.30.253.121|:443... connected.
[00:01:23] HTTP request sent, awaiting response... 200 OK
[00:01:23] Length: unspecified [application/x-gzip]
[00:01:23] Saving to: 'i18n.tar.gz'
[00:01:23] 
[00:01:24]      0K .......... .......... .......... .......... ..........  210K
[00:01:24]     50K .......... .......... .......... .......... ..........  490K
[00:01:24]    100K .......... .......... .......... .......... .......... 11.8M
[00:01:24]    150K .......... .......... .......... .......... ..........  511K
[00:01:24]    200K .......... .......... .......... .......... .......... 13.0M
[00:01:24]    250K .......... .......... .......... .......... .......... 11.0M
[00:01:24]    300K .......... .......... .......... .......... .......... 11.9M
[00:01:24]    350K .......... .......... .......... .......... .......... 10.3M
[00:01:24]    400K .......... .......... .......... .......... ..........  570K
[00:01:24]    450K .......... .......... .......... .......... .......... 11.4M
[00:01:24]    500K .......... .......... .......... .......... .......... 11.1M
[00:01:24]    550K .......... .......... .......... .......... .......... 9.63M
[00:01:24]    600K .......... .......... .......... .......... .......... 12.4M
[00:01:24]    650K .......... .......... .......... .......... .......... 12.9M
[00:01:24]    700K .......... .......... .......... .......... .......... 12.6M
[00:01:24]    750K .......... .......... .......... .......... .......... 11.6M
[00:01:24]    800K .......... .......... .......... .......... .......... 3.10M
[00:01:24]    850K .......... .......... .......... .......... ..........  863K
[00:01:24]    900K .......... .......... .......... .......... .......... 11.2M
[00:01:24]    950K .......... .......... .......... .......... .......... 9.47M
[00:01:24]   1000K .......... .......... .......... .......... .......... 12.6M
[00:01:24]   1050K .......... .......... .......... .......... .......... 12.5M
[00:01:24]   1100K .......... .......... .......... .......... .......... 12.2M
[00:01:24]   1150K .......... .......... .......... .......... .......... 12.3M
[00:01:24]   1200K .......... .......... .......... .......... .......... 12.0M
[00:01:24]   1250K .......... .......... .......... .......... .......... 13.7M
[00:01:24]   1300K .......... .......... .......... .......... .......... 8.88M
[00:01:24]   1350K .......... .......... .......... .......... .......... 13.8M
[00:01:24]   1400K .......... ..                                           161M=0.7s
[00:01:24] 
[00:01:24] 2019-02-02 22:40:36 (1.99 MB/s) - 'i18n.tar.gz' saved [1445952]
[00:01:24] 
[00:01:24] 0
[00:01:24] now running: ssh -f -o "StrictHostKeyChecking no" -o Port=22 -i /etc/lightbuildserver/container/container_rsa root@10.0.3.5 "export LC_ALL=C; (sed -e 's/Release:.*%{release}/Release: 0/g' lbs-openpetra/openpetranow-mysql-test/openpetranow-mysql-test.spec > /tmp/openpetranow-mysql-test.spec) 2>&1 && echo \$?"
[00:01:24] 0
[00:01:24] now running: ssh -f -o "StrictHostKeyChecking no" -o Port=22 -i /etc/lightbuildserver/container/container_rsa root@10.0.3.5 "export LC_ALL=C; (yum-builddep -y /tmp/openpetranow-mysql-test.spec) 2>&1 && echo \$?"
[00:01:25] Loaded plugins: fastestmirror, priorities
[00:01:25] Enabling epel-source repository
[00:01:25] Enabling epel-testing-source repository
[00:01:25] Enabling nodesource-source repository
[00:01:25] Loading mirror speeds from cached hostfile
[00:01:29]  * base: ftp.plusline.net
[00:01:29]  * epel: ftp.plusline.net
[00:01:29]  * epel-source: mirror.23media.de
[00:01:29]  * epel-testing: ftp.plusline.net
[00:01:29]  * epel-testing-source: mirror.23media.de
[00:01:29]  * extras: centosmirror.netcup.net
[00:01:29]  * updates: mirror.fra10.de.leaseweb.net
[00:01:32] Checking for new repos for mirrors
[00:01:32] Getting requirements for /tmp/openpetranow-mysql-test.spec
[00:01:32]  --> 1:nant-0.92-15.el7.x86_64
[00:01:32]  --> dos2unix-6.0.3-7.el7.x86_64
[00:01:32]  --> gettext-0.19.8.1-2.el7.x86_64
[00:01:32]  --> mono-mvc-5.18.0-1.el7.x86_64
[00:01:32]  --> mono-wcf-5.18.0-1.el7.x86_64
[00:01:32]  --> mono-devel-5.18.0-1.el7.x86_64
[00:01:32]  --> 1:liberation-mono-fonts-1.07.2-16.el7.noarch
[00:01:32]  --> libgdiplus-devel-2.10-10.el7.x86_64
[00:01:32]  --> Already installed : 2:nodejs-8.15.0-1nodesource.x86_64
[00:01:32] --> Running transaction check
[00:01:32] ---> Package dos2unix.x86_64 0:6.0.3-7.el7 will be installed
[00:01:32] ---> Package gettext.x86_64 0:0.19.8.1-2.el7 will be installed
[00:01:32] --> Processing Dependency: gettext-libs(x86-64) = 0.19.8.1-2.el7 for package: gettext-0.19.8.1-2.el7.x86_64
[00:01:32] --> Processing Dependency: libunistring.so.0()(64bit) for package: gettext-0.19.8.1-2.el7.x86_64
[00:01:32] --> Processing Dependency: libgettextsrc-0.19.8.1.so()(64bit) for package: gettext-0.19.8.1-2.el7.x86_64
[00:01:32] --> Processing Dependency: libgettextlib-0.19.8.1.so()(64bit) for package: gettext-0.19.8.1-2.el7.x86_64
[00:01:32] --> Processing Dependency: libcroco-0.6.so.3()(64bit) for package: gettext-0.19.8.1-2.el7.x86_64
[00:01:32] ---> Package liberation-mono-fonts.noarch 1:1.07.2-16.el7 will be installed
[00:01:32] --> Processing Dependency: liberation-fonts-common = 1:1.07.2-16.el7 for package: 1:liberation-mono-fonts-1.07.2-16.el7.noarch
[00:01:32] ---> Package libgdiplus-devel.x86_64 0:2.10-10.el7 will be installed
[00:01:32] --> Processing Dependency: libgdiplus = 2.10-10.el7 for package: libgdiplus-devel-2.10-10.el7.x86_64
[00:01:32] --> Processing Dependency: pkgconfig(glib-2.0) for package: libgdiplus-devel-2.10-10.el7.x86_64
[00:01:32] --> Processing Dependency: pkgconfig(gmodule-2.0) for package: libgdiplus-devel-2.10-10.el7.x86_64
[00:01:32] --> Processing Dependency: pkgconfig(gthread-2.0) for package: libgdiplus-devel-2.10-10.el7.x86_64
[00:01:32] --> Processing Dependency: libgdiplus.so.0()(64bit) for package: libgdiplus-devel-2.10-10.el7.x86_64
[00:01:32] ---> Package mono-devel.x86_64 0:5.18.0-1.el7 will be installed
[00:01:32] --> Processing Dependency: mono-core = 5.18.0-1.el7 for package: mono-devel-5.18.0-1.el7.x86_64
[00:01:32] --> Processing Dependency: mono(Commons.Xml.Relaxng) = 4.0.0.0 for package: mono-devel-5.18.0-1.el7.x86_64
[00:01:32] --> Processing Dependency: mono(Mono.Cecil) = 0.10.0.0 for package: mono-devel-5.18.0-1.el7.x86_64
[00:01:32] --> Processing Dependency: mono(Mono.CodeContracts) = 4.0.0.0 for package: mono-devel-5.18.0-1.el7.x86_64
[00:01:32] --> Processing Dependency: mono(Mono.CompilerServices.SymbolWriter) = 4.0.0.0 for package: mono-devel-5.18.0-1.el7.x86_64
[00:01:32] --> Processing Dependency: mono(monodoc) = 1.0.0.0 for package: mono-devel-5.18.0-1.el7.x86_64
[00:01:32] --> Processing Dependency: mono(Mono.Security) = 4.0.0.0 for package: mono-devel-5.18.0-1.el7.x86_64
[00:01:32] --> Processing Dependency: mono(mscorlib) = 4.0.0.0 for package: mono-devel-5.18.0-1.el7.x86_64
[00:01:32] --> Processing Dependency: mono(System) = 4.0.0.0 for package: mono-devel-5.18.0-1.el7.x86_64
[00:01:32] --> Processing Dependency: mono(System.Configuration) = 4.0.0.0 for package: mono-devel-5.18.0-1.el7.x86_64
[00:01:32] --> Processing Dependency: mono(System.Configuration.Install) = 4.0.0.0 for package: mono-devel-5.18.0-1.el7.x86_64
[00:01:32] --> Processing Dependency: mono(System.Core) = 4.0.0.0 for package: mono-devel-5.18.0-1.el7.x86_64
[00:01:32] --> Processing Dependency: mono(System.Data) = 4.0.0.0 for package: mono-devel-5.18.0-1.el7.x86_64
[00:01:32] --> Processing Dependency: mono(System.Drawing) = 4.0.0.0 for package: mono-devel-5.18.0-1.el7.x86_64
[00:01:32] --> Processing Dependency: mono(System.IO.Compression.FileSystem) = 4.0.0.0 for package: mono-devel-5.18.0-1.el7.x86_64
[00:01:32] --> Processing Dependency: mono(System.Runtime.Serialization) = 4.0.0.0 for package: mono-devel-5.18.0-1.el7.x86_64
[00:01:32] --> Processing Dependency: mono(System.Security) = 4.0.0.0 for package: mono-devel-5.18.0-1.el7.x86_64
[00:01:32] --> Processing Dependency: mono(System.Xml) = 4.0.0.0 for package: mono-devel-5.18.0-1.el7.x86_64
[00:01:32] --> Processing Dependency: mono(System.Xml.Linq) = 4.0.0.0 for package: mono-devel-5.18.0-1.el7.x86_64
[00:01:32] ---> Package mono-mvc.x86_64 0:5.18.0-1.el7 will be installed
[00:01:32] --> Processing Dependency: mono(Microsoft.Web.Infrastructure) = 1.0.0.0 for package: mono-mvc-5.18.0-1.el7.x86_64
[00:01:32] --> Processing Dependency: mono(System.ComponentModel.DataAnnotations) = 4.0.0.0 for package: mono-mvc-5.18.0-1.el7.x86_64
[00:01:32] --> Processing Dependency: mono(System.Design) = 4.0.0.0 for package: mono-mvc-5.18.0-1.el7.x86_64
[00:01:32] --> Processing Dependency: mono(System.Web) = 4.0.0.0 for package: mono-mvc-5.18.0-1.el7.x86_64
[00:01:32] --> Processing Dependency: mono(System.Web.ApplicationServices) = 4.0.0.0 for package: mono-mvc-5.18.0-1.el7.x86_64
[00:01:32] --> Processing Dependency: mono(System.Web.Razor) = 2.0.0.0 for package: mono-mvc-5.18.0-1.el7.x86_64
[00:01:32] --> Processing Dependency: mono(System.Web.Services) = 4.0.0.0 for package: mono-mvc-5.18.0-1.el7.x86_64
[00:01:32] --> Processing Dependency: mono(System.Web.WebPages) = 2.0.0.0 for package: mono-mvc-5.18.0-1.el7.x86_64
[00:01:32] --> Processing Dependency: mono(System.Web.WebPages.Razor) = 2.0.0.0 for package: mono-mvc-5.18.0-1.el7.x86_64
[00:01:32] ---> Package mono-wcf.x86_64 0:5.18.0-1.el7 will be installed
[00:01:32] ---> Package nant.x86_64 1:0.92-15.el7 will be installed
[00:01:32] --> Processing Dependency: mono(log4net) = 1.2.15.0 for package: 1:nant-0.92-15.el7.x86_64
[00:01:32] --> Processing Dependency: mono(nunit.core) = 2.6.4.0 for package: 1:nant-0.92-15.el7.x86_64
[00:01:32] --> Processing Dependency: mono(nunit.core.interfaces) = 2.6.4.0 for package: 1:nant-0.92-15.el7.x86_64
[00:01:32] --> Processing Dependency: mono(nunit.util) = 2.6.4.0 for package: 1:nant-0.92-15.el7.x86_64
[00:01:32] --> Processing Dependency: nunit2 for package: 1:nant-0.92-15.el7.x86_64
[00:01:32] --> Running transaction check
[00:01:32] ---> Package gettext-libs.x86_64 0:0.19.8.1-2.el7 will be installed
[00:01:32] ---> Package glib2-devel.x86_64 0:2.56.1-2.el7 will be installed
[00:01:32] --> Processing Dependency: pkgconfig(libpcre) for package: glib2-devel-2.56.1-2.el7.x86_64
[00:01:32] ---> Package libcroco.x86_64 0:0.6.12-4.el7 will be installed
[00:01:32] ---> Package liberation-fonts-common.noarch 1:1.07.2-16.el7 will be installed
[00:01:32] --> Processing Dependency: fontpackages-filesystem >= 1.13 for package: 1:liberation-fonts-common-1.07.2-16.el7.noarch
[00:01:32] ---> Package libgdiplus.x86_64 0:2.10-10.el7 will be installed
[00:01:32] --> Processing Dependency: libjpeg.so.62(LIBJPEG_6.2)(64bit) for package: libgdiplus-2.10-10.el7.x86_64
[00:01:32] --> Processing Dependency: libpng15.so.15(PNG15_0)(64bit) for package: libgdiplus-2.10-10.el7.x86_64
[00:01:32] --> Processing Dependency: libtiff.so.5(LIBTIFF_4.0)(64bit) for package: libgdiplus-2.10-10.el7.x86_64
[00:01:32] --> Processing Dependency: libX11.so.6()(64bit) for package: libgdiplus-2.10-10.el7.x86_64
[00:01:32] --> Processing Dependency: libXrender.so.1()(64bit) for package: libgdiplus-2.10-10.el7.x86_64
[00:01:32] --> Processing Dependency: libcairo.so.2()(64bit) for package: libgdiplus-2.10-10.el7.x86_64
[00:01:33] --> Processing Dependency: libexif.so.12()(64bit) for package: libgdiplus-2.10-10.el7.x86_64
[00:01:33] --> Processing Dependency: libfontconfig.so.1()(64bit) for package: libgdiplus-2.10-10.el7.x86_64
[00:01:33] --> Processing Dependency: libfreetype.so.6()(64bit) for package: libgdiplus-2.10-10.el7.x86_64
[00:01:33] --> Processing Dependency: libgif.so.4()(64bit) for package: libgdiplus-2.10-10.el7.x86_64
[00:01:33] --> Processing Dependency: libjpeg.so.62()(64bit) for package: libgdiplus-2.10-10.el7.x86_64
[00:01:33] --> Processing Dependency: libpng15.so.15()(64bit) for package: libgdiplus-2.10-10.el7.x86_64
[00:01:33] --> Processing Dependency: libtiff.so.5()(64bit) for package: libgdiplus-2.10-10.el7.x86_64
[00:01:33] ---> Package libunistring.x86_64 0:0.9.3-9.el7 will be installed
[00:01:33] ---> Package log4net.x86_64 0:1.2.15-4.el7 will be installed
[00:01:33] ---> Package mono-core.x86_64 0:5.18.0-1.el7 will be installed
[00:01:33] ---> Package mono-data.x86_64 0:5.18.0-1.el7 will be installed
[00:01:33] ---> Package mono-extras.x86_64 0:5.18.0-1.el7 will be installed
[00:01:33] ---> Package mono-web.x86_64 0:5.18.0-1.el7 will be installed
[00:01:33] --> Processing Dependency: mono(Mono.Data.Sqlite) = 4.0.0.0 for package: mono-web-5.18.0-1.el7.x86_64
[00:01:33] ---> Package mono-winforms.x86_64 0:5.18.0-1.el7 will be installed
[00:01:33] ---> Package monodoc.x86_64 0:5.18.0-1.el7 will be installed
[00:01:33] ---> Package nunit2.x86_64 0:2.6.4-14.el7 will be installed
[00:01:33] --> Running transaction check
[00:01:33] ---> Package cairo.x86_64 0:1.15.12-3.el7 will be installed
[00:01:33] --> Processing Dependency: libxcb.so.1()(64bit) for package: cairo-1.15.12-3.el7.x86_64
[00:01:33] --> Processing Dependency: libxcb-shm.so.0()(64bit) for package: cairo-1.15.12-3.el7.x86_64
[00:01:33] --> Processing Dependency: libxcb-render.so.0()(64bit) for package: cairo-1.15.12-3.el7.x86_64
[00:01:33] --> Processing Dependency: libpixman-1.so.0()(64bit) for package: cairo-1.15.12-3.el7.x86_64
[00:01:33] --> Processing Dependency: libXext.so.6()(64bit) for package: cairo-1.15.12-3.el7.x86_64
[00:01:33] --> Processing Dependency: libGL.so.1()(64bit) for package: cairo-1.15.12-3.el7.x86_64
[00:01:33] --> Processing Dependency: libEGL.so.1()(64bit) for package: cairo-1.15.12-3.el7.x86_64
[00:01:33] ---> Package fontconfig.x86_64 0:2.13.0-4.3.el7 will be installed
[00:01:33] --> Processing Dependency: dejavu-sans-fonts for package: fontconfig-2.13.0-4.3.el7.x86_64
[00:01:33] ---> Package fontpackages-filesystem.noarch 0:1.44-8.el7 will be installed
[00:01:33] ---> Package freetype.x86_64 0:2.8-12.el7_6.1 will be installed
[00:01:33] ---> Package giflib.x86_64 0:4.1.6-9.el7 will be installed
[00:01:33] --> Processing Dependency: libSM.so.6()(64bit) for package: giflib-4.1.6-9.el7.x86_64
[00:01:33] --> Processing Dependency: libICE.so.6()(64bit) for package: giflib-4.1.6-9.el7.x86_64
[00:01:33] ---> Package libX11.x86_64 0:1.6.5-2.el7 will be installed
[00:01:33] --> Processing Dependency: libX11-common >= 1.6.5-2.el7 for package: libX11-1.6.5-2.el7.x86_64
[00:01:33] ---> Package libXrender.x86_64 0:0.9.10-1.el7 will be installed
[00:01:33] ---> Package libexif.x86_64 0:0.6.21-6.el7 will be installed
[00:01:33] ---> Package libjpeg-turbo.x86_64 0:1.2.90-6.el7 will be installed
[00:01:33] ---> Package libpng.x86_64 2:1.5.13-7.el7_2 will be installed
[00:01:33] ---> Package libtiff.x86_64 0:4.0.3-27.el7_3 will be installed
[00:01:33] --> Processing Dependency: libjbig.so.2.0()(64bit) for package: libtiff-4.0.3-27.el7_3.x86_64
[00:01:33] ---> Package mono-data-sqlite.x86_64 0:5.18.0-1.el7 will be installed
[00:01:33] ---> Package pcre-devel.x86_64 0:8.32-17.el7 will be installed
[00:01:33] --> Running transaction check
[00:01:33] ---> Package dejavu-sans-fonts.noarch 0:2.33-6.el7 will be installed
[00:01:33] --> Processing Dependency: dejavu-fonts-common = 2.33-6.el7 for package: dejavu-sans-fonts-2.33-6.el7.noarch
[00:01:33] ---> Package jbigkit-libs.x86_64 0:2.0-11.el7 will be installed
[00:01:33] ---> Package libICE.x86_64 0:1.0.9-9.el7 will be installed
[00:01:33] ---> Package libSM.x86_64 0:1.2.2-2.el7 will be installed
[00:01:33] ---> Package libX11-common.noarch 0:1.6.5-2.el7 will be installed
[00:01:33] ---> Package libXext.x86_64 0:1.3.3-3.el7 will be installed
[00:01:33] ---> Package libglvnd-egl.x86_64 1:1.0.1-0.8.git5baa1e5.el7 will be installed
[00:01:33] --> Processing Dependency: libglvnd(x86-64) = 1:1.0.1-0.8.git5baa1e5.el7 for package: 1:libglvnd-egl-1.0.1-0.8.git5baa1e5.el7.x86_64
[00:01:33] --> Processing Dependency: mesa-libEGL(x86-64) >= 13.0.4-1 for package: 1:libglvnd-egl-1.0.1-0.8.git5baa1e5.el7.x86_64
[00:01:33] --> Processing Dependency: libGLdispatch.so.0()(64bit) for package: 1:libglvnd-egl-1.0.1-0.8.git5baa1e5.el7.x86_64
[00:01:33] ---> Package libglvnd-glx.x86_64 1:1.0.1-0.8.git5baa1e5.el7 will be installed
[00:01:33] --> Processing Dependency: mesa-libGL(x86-64) >= 13.0.4-1 for package: 1:libglvnd-glx-1.0.1-0.8.git5baa1e5.el7.x86_64
[00:01:33] ---> Package libxcb.x86_64 0:1.13-1.el7 will be installed
[00:01:33] --> Processing Dependency: libXau.so.6()(64bit) for package: libxcb-1.13-1.el7.x86_64
[00:01:33] ---> Package pixman.x86_64 0:0.34.0-1.el7 will be installed
[00:01:33] --> Running transaction check
[00:01:33] ---> Package dejavu-fonts-common.noarch 0:2.33-6.el7 will be installed
[00:01:33] ---> Package libXau.x86_64 0:1.0.8-2.1.el7 will be installed
[00:01:33] ---> Package libglvnd.x86_64 1:1.0.1-0.8.git5baa1e5.el7 will be installed
[00:01:33] ---> Package mesa-libEGL.x86_64 0:18.0.5-4.el7_6 will be installed
[00:01:33] --> Processing Dependency: mesa-libgbm = 18.0.5-4.el7_6 for package: mesa-libEGL-18.0.5-4.el7_6.x86_64
[00:01:33] --> Processing Dependency: libxshmfence.so.1()(64bit) for package: mesa-libEGL-18.0.5-4.el7_6.x86_64
[00:01:33] --> Processing Dependency: libwayland-server.so.0()(64bit) for package: mesa-libEGL-18.0.5-4.el7_6.x86_64
[00:01:33] --> Processing Dependency: libwayland-client.so.0()(64bit) for package: mesa-libEGL-18.0.5-4.el7_6.x86_64
[00:01:33] --> Processing Dependency: libglapi.so.0()(64bit) for package: mesa-libEGL-18.0.5-4.el7_6.x86_64
[00:01:33] --> Processing Dependency: libgbm.so.1()(64bit) for package: mesa-libEGL-18.0.5-4.el7_6.x86_64
[00:01:33] --> Processing Dependency: libdrm.so.2()(64bit) for package: mesa-libEGL-18.0.5-4.el7_6.x86_64
[00:01:33] ---> Package mesa-libGL.x86_64 0:18.0.5-4.el7_6 will be installed
[00:01:33] --> Processing Dependency: libXxf86vm.so.1()(64bit) for package: mesa-libGL-18.0.5-4.el7_6.x86_64
[00:01:33] --> Processing Dependency: libXfixes.so.3()(64bit) for package: mesa-libGL-18.0.5-4.el7_6.x86_64
[00:01:33] --> Processing Dependency: libXdamage.so.1()(64bit) for package: mesa-libGL-18.0.5-4.el7_6.x86_64
[00:01:33] --> Running transaction check
[00:01:33] ---> Package libXdamage.x86_64 0:1.1.4-4.1.el7 will be installed
[00:01:33] ---> Package libXfixes.x86_64 0:5.0.3-1.el7 will be installed
[00:01:33] ---> Package libXxf86vm.x86_64 0:1.1.4-1.el7 will be installed
[00:01:33] ---> Package libdrm.x86_64 0:2.4.91-3.el7 will be installed
[00:01:33] --> Processing Dependency: libpciaccess.so.0()(64bit) for package: libdrm-2.4.91-3.el7.x86_64
[00:01:33] ---> Package libwayland-client.x86_64 0:1.15.0-1.el7 will be installed
[00:01:33] ---> Package libwayland-server.x86_64 0:1.15.0-1.el7 will be installed
[00:01:33] ---> Package libxshmfence.x86_64 0:1.2-1.el7 will be installed
[00:01:33] ---> Package mesa-libgbm.x86_64 0:18.0.5-4.el7_6 will be installed
[00:01:33] ---> Package mesa-libglapi.x86_64 0:18.0.5-4.el7_6 will be installed
[00:01:33] --> Running transaction check
[00:01:33] ---> Package libpciaccess.x86_64 0:0.14-1.el7 will be installed
[00:01:33] --> Processing Dependency: hwdata for package: libpciaccess-0.14-1.el7.x86_64
[00:01:33] --> Running transaction check
[00:01:33] ---> Package hwdata.x86_64 0:0.252-9.1.el7 will be installed
[00:01:33] --> Finished Dependency Resolution
[00:01:33] 
[00:01:33] Dependencies Resolved
[00:01:33] 
[00:01:33] ================================================================================
[00:01:33]  Package             Arch   Version                    Repository          Size
[00:01:33] ================================================================================
[00:01:33] Installing:
[00:01:33]  dos2unix            x86_64 6.0.3-7.el7                base                74 k
[00:01:33]  gettext             x86_64 0.19.8.1-2.el7             base               1.0 M
[00:01:33]  liberation-mono-fonts
[00:01:33]                      noarch 1:1.07.2-16.el7            base               227 k
[00:01:33]  libgdiplus-devel    x86_64 2.10-10.el7                epel               9.7 k
[00:01:33]  mono-devel          x86_64 5.18.0-1.el7               tpokorra-mono-5.18 4.6 M
[00:01:33]  mono-mvc            x86_64 5.18.0-1.el7               tpokorra-mono-5.18 481 k
[00:01:33]  mono-wcf            x86_64 5.18.0-1.el7               tpokorra-mono-5.18 915 k
[00:01:33]  nant                x86_64 1:0.92-15.el7              epel               604 k
[00:01:33] Installing for dependencies:
[00:01:33]  cairo               x86_64 1.15.12-3.el7              base               741 k
[00:01:33]  dejavu-fonts-common noarch 2.33-6.el7                 base                64 k
[00:01:33]  dejavu-sans-fonts   noarch 2.33-6.el7                 base               1.4 M
[00:01:33]  fontconfig          x86_64 2.13.0-4.3.el7             base               254 k
[00:01:33]  fontpackages-filesystem
[00:01:33]                      noarch 1.44-8.el7                 base               9.9 k
[00:01:33]  freetype            x86_64 2.8-12.el7_6.1             updates            380 k
[00:01:33]  gettext-libs        x86_64 0.19.8.1-2.el7             base               501 k
[00:01:33]  giflib              x86_64 4.1.6-9.el7                base                40 k
[00:01:33]  glib2-devel         x86_64 2.56.1-2.el7               base               453 k
[00:01:33]  hwdata              x86_64 0.252-9.1.el7              base               2.3 M
[00:01:33]  jbigkit-libs        x86_64 2.0-11.el7                 base                46 k
[00:01:33]  libICE              x86_64 1.0.9-9.el7                base                66 k
[00:01:33]  libSM               x86_64 1.2.2-2.el7                base                39 k
[00:01:33]  libX11              x86_64 1.6.5-2.el7                base               606 k
[00:01:33]  libX11-common       noarch 1.6.5-2.el7                base               164 k
[00:01:33]  libXau              x86_64 1.0.8-2.1.el7              base                29 k
[00:01:33]  libXdamage          x86_64 1.1.4-4.1.el7              base                20 k
[00:01:33]  libXext             x86_64 1.3.3-3.el7                base                39 k
[00:01:33]  libXfixes           x86_64 5.0.3-1.el7                base                18 k
[00:01:33]  libXrender          x86_64 0.9.10-1.el7               base                26 k
[00:01:33]  libXxf86vm          x86_64 1.1.4-1.el7                base                18 k
[00:01:33]  libcroco            x86_64 0.6.12-4.el7               base               105 k
[00:01:33]  libdrm              x86_64 2.4.91-3.el7               base               153 k
[00:01:33]  liberation-fonts-common
[00:01:33]                      noarch 1:1.07.2-16.el7            base                27 k
[00:01:33]  libexif             x86_64 0.6.21-6.el7               base               347 k
[00:01:33]  libgdiplus          x86_64 2.10-10.el7                epel               163 k
[00:01:33]  libglvnd            x86_64 1:1.0.1-0.8.git5baa1e5.el7 base                89 k
[00:01:33]  libglvnd-egl        x86_64 1:1.0.1-0.8.git5baa1e5.el7 base                44 k
[00:01:33]  libglvnd-glx        x86_64 1:1.0.1-0.8.git5baa1e5.el7 base               125 k
[00:01:33]  libjpeg-turbo       x86_64 1.2.90-6.el7               base               134 k
[00:01:33]  libpciaccess        x86_64 0.14-1.el7                 base                26 k
[00:01:33]  libpng              x86_64 2:1.5.13-7.el7_2           base               213 k
[00:01:33]  libtiff             x86_64 4.0.3-27.el7_3             base               170 k
[00:01:33]  libunistring        x86_64 0.9.3-9.el7                base               293 k
[00:01:33]  libwayland-client   x86_64 1.15.0-1.el7               base                33 k
[00:01:33]  libwayland-server   x86_64 1.15.0-1.el7               base                39 k
[00:01:33]  libxcb              x86_64 1.13-1.el7                 base               214 k
[00:01:33]  libxshmfence        x86_64 1.2-1.el7                  base               7.2 k
[00:01:33]  log4net             x86_64 1.2.15-4.el7               epel               163 k
[00:01:33]  mesa-libEGL         x86_64 18.0.5-4.el7_6             updates            102 k
[00:01:33]  mesa-libGL          x86_64 18.0.5-4.el7_6             updates            162 k
[00:01:33]  mesa-libgbm         x86_64 18.0.5-4.el7_6             updates             38 k
[00:01:33]  mesa-libglapi       x86_64 18.0.5-4.el7_6             updates             44 k
[00:01:33]  mono-core           x86_64 5.18.0-1.el7               tpokorra-mono-5.18  28 M
[00:01:33]  mono-data           x86_64 5.18.0-1.el7               tpokorra-mono-5.18 4.5 M
[00:01:33]  mono-data-sqlite    x86_64 5.18.0-1.el7               tpokorra-mono-5.18 100 k
[00:01:33]  mono-extras         x86_64 5.18.0-1.el7               tpokorra-mono-5.18 460 k
[00:01:33]  mono-web            x86_64 5.18.0-1.el7               tpokorra-mono-5.18 2.5 M
[00:01:33]  mono-winforms       x86_64 5.18.0-1.el7               tpokorra-mono-5.18 1.6 M
[00:01:33]  monodoc             x86_64 5.18.0-1.el7               tpokorra-mono-5.18  19 M
[00:01:33]  nunit2              x86_64 2.6.4-14.el7               epel               284 k
[00:01:33]  pcre-devel          x86_64 8.32-17.el7                base               480 k
[00:01:33]  pixman              x86_64 0.34.0-1.el7               base               248 k
[00:01:33] 
[00:01:33] Transaction Summary
[00:01:33] ================================================================================
[00:01:33] Install  8 Packages (+53 Dependent packages)
[00:01:33] 
[00:01:33] Total size: 74 M
[00:01:33] Installed size: 209 M
[00:01:33] Downloading packages:
[00:01:33] warning: /var/cache/yum/x86_64/7/epel/packages/libgdiplus-2.10-10.el7.x86_64.rpm: Header V3 RSA/SHA256 Signature, key ID 352c64e5: NOKEY
[00:01:33] Retrieving key from file:///etc/pki/rpm-gpg/RPM-GPG-KEY-EPEL-7
[00:01:33] Importing GPG key 0x352C64E5:
[00:01:33]  Userid     : "Fedora EPEL (7) <epel@fedoraproject.org>"
[00:01:33]  Fingerprint: 91e9 7d7c 4a5e 96f1 7f3e 888f 6a2f aea2 352c 64e5
[00:01:33]  Package    : epel-release-7-11.noarch (@extras)
[00:01:33]  From       : /etc/pki/rpm-gpg/RPM-GPG-KEY-EPEL-7
[00:01:33] Key imported successfully
[00:01:33] warning: /var/cache/yum/x86_64/7/tpokorra-mono-5.18/packages/mono-wcf-5.18.0-1.el7.x86_64.rpm: Header V3 RSA/SHA1 Signature, key ID a07e20db: NOKEY
[00:01:33] Retrieving key from https://copr-be.cloud.fedoraproject.org/results/tpokorra/mono-5.18/pubkey.gpg
[00:01:34] Importing GPG key 0xA07E20DB:
[00:01:34]  Userid     : "tpokorra_mono-5.18 (None) <tpokorra#mono-5.18@copr.fedorahosted.org>"
[00:01:34]  Fingerprint: bc81 24c6 04ed 4879 4346 988a 742d cbb8 a07e 20db
[00:01:34]  From       : https://copr-be.cloud.fedoraproject.org/results/tpokorra/mono-5.18/pubkey.gpg
[00:01:35] Key imported successfully
[00:01:35] Running transaction check
[00:01:35] Running transaction test
[00:01:35] Transaction test succeeded
[00:01:35] Running transaction
[00:01:35]   Installing : mesa-libglapi-18.0.5-4.el7_6.x86_64                         1/61 
[00:01:35]   Installing : 2:libpng-1.5.13-7.el7_2.x86_64                              2/61 
[00:01:35]   Installing : freetype-2.8-12.el7_6.1.x86_64                              3/61 
[00:01:35]   Installing : fontpackages-filesystem-1.44-8.el7.noarch                   4/61 
[00:01:35]   Installing : libwayland-server-1.15.0-1.el7.x86_64                       5/61 
[00:01:35]   Installing : 1:libglvnd-1.0.1-0.8.git5baa1e5.el7.x86_64                  6/61 
[00:01:35]   Installing : libcroco-0.6.12-4.el7.x86_64                                7/61 
[00:01:35]   Installing : libjpeg-turbo-1.2.90-6.el7.x86_64                           8/61 
[00:01:35]   Installing : libICE-1.0.9-9.el7.x86_64                                   9/61 
[00:01:35]   Installing : libunistring-0.9.3-9.el7.x86_64                            10/61 
[00:01:35]   Installing : libxshmfence-1.2-1.el7.x86_64                              11/61 
[00:01:36]   Installing : gettext-libs-0.19.8.1-2.el7.x86_64                         12/61 
[00:01:36]   Installing : libSM-1.2.2-2.el7.x86_64                                   13/61 
[00:01:36]   Installing : dejavu-fonts-common-2.33-6.el7.noarch                      14/61 
[00:01:36]   Installing : dejavu-sans-fonts-2.33-6.el7.noarch                        15/61 
[00:01:37]   Installing : fontconfig-2.13.0-4.3.el7.x86_64                           16/61 
[00:01:37]   Installing : 1:liberation-fonts-common-1.07.2-16.el7.noarch             17/61 
[00:01:37]   Installing : libXau-1.0.8-2.1.el7.x86_64                                18/61 
[00:01:37]   Installing : libxcb-1.13-1.el7.x86_64                                   19/61 
[00:01:37]   Installing : libexif-0.6.21-6.el7.x86_64                                20/61 
[00:01:37]   Installing : jbigkit-libs-2.0-11.el7.x86_64                             21/61 
[00:01:37]   Installing : libtiff-4.0.3-27.el7_3.x86_64                              22/61 
[00:01:37]   Installing : pixman-0.34.0-1.el7.x86_64                                 23/61 
[00:01:38]   Installing : hwdata-0.252-9.1.el7.x86_64                                24/61 
[00:01:38]   Installing : libpciaccess-0.14-1.el7.x86_64                             25/61 
[00:01:38]   Installing : libdrm-2.4.91-3.el7.x86_64                                 26/61 
[00:01:38]   Installing : mesa-libgbm-18.0.5-4.el7_6.x86_64                          27/61 
[00:01:38]   Installing : libwayland-client-1.15.0-1.el7.x86_64                      28/61 
[00:01:38]   Installing : libX11-common-1.6.5-2.el7.noarch                           29/61 
[00:01:38]   Installing : libX11-1.6.5-2.el7.x86_64                                  30/61 
[00:01:38]   Installing : libXext-1.3.3-3.el7.x86_64                                 31/61 
[00:01:38]   Installing : libXrender-0.9.10-1.el7.x86_64                             32/61 
[00:01:38]   Installing : libXfixes-5.0.3-1.el7.x86_64                               33/61 
[00:01:38]   Installing : libXdamage-1.1.4-4.1.el7.x86_64                            34/61 
[00:01:38]   Installing : libXxf86vm-1.1.4-1.el7.x86_64                              35/61 
[00:01:38]   Installing : mesa-libGL-18.0.5-4.el7_6.x86_64                           36/61 
[00:01:38]   Installing : 1:libglvnd-glx-1.0.1-0.8.git5baa1e5.el7.x86_64             37/61 
[00:01:38]   Installing : giflib-4.1.6-9.el7.x86_64                                  38/61 
[00:01:38]   Installing : 1:libglvnd-egl-1.0.1-0.8.git5baa1e5.el7.x86_64             39/61 
[00:01:38]   Installing : mesa-libEGL-18.0.5-4.el7_6.x86_64                          40/61 
[00:01:39]   Installing : cairo-1.15.12-3.el7.x86_64                                 41/61 
[00:01:39]   Installing : libgdiplus-2.10-10.el7.x86_64                              42/61 
[00:01:39]   Installing : mono-data-sqlite-5.18.0-1.el7.x86_64                       43/61 
[00:01:39]   Installing : mono-data-5.18.0-1.el7.x86_64                              44/61 
[00:01:39]   Installing : mono-winforms-5.18.0-1.el7.x86_64                          45/61 
[00:01:40]   Installing : mono-mvc-5.18.0-1.el7.x86_64                               46/61 
[00:01:40]   Installing : mono-web-5.18.0-1.el7.x86_64                               47/61 
[00:01:40]   Installing : mono-wcf-5.18.0-1.el7.x86_64                               48/61 
[00:01:44]   Installing : mono-extras-5.18.0-1.el7.x86_64                            49/61 
[00:01:44]   Installing : mono-core-5.18.0-1.el7.x86_64                              50/61 
[00:01:44]   Installing : log4net-1.2.15-4.el7.x86_64                                51/61 
[00:01:45]   Installing : nunit2-2.6.4-14.el7.x86_64                                 52/61 
[00:01:45]   Installing : monodoc-5.18.0-1.el7.x86_64                                53/61 
[00:01:45]   Installing : pcre-devel-8.32-17.el7.x86_64                              54/61 
[00:01:45]   Installing : glib2-devel-2.56.1-2.el7.x86_64                            55/61 
[00:01:46]   Installing : libgdiplus-devel-2.10-10.el7.x86_64                        56/61 
[00:01:46]   Installing : mono-devel-5.18.0-1.el7.x86_64                             57/61 
[00:01:46]   Installing : 1:nant-0.92-15.el7.x86_64                                  58/61 
[00:01:46]   Installing : 1:liberation-mono-fonts-1.07.2-16.el7.noarch               59/61 
[00:01:46]   Installing : gettext-0.19.8.1-2.el7.x86_64                              60/61 
[00:01:46]   Installing : dos2unix-6.0.3-7.el7.x86_64                                61/61 
[00:01:46]   Verifying  : libgdiplus-2.10-10.el7.x86_64                               1/61 
[00:01:46]   Verifying  : libXext-1.3.3-3.el7.x86_64                                  2/61 
[00:01:46]   Verifying  : libtiff-4.0.3-27.el7_3.x86_64                               3/61 
[00:01:46]   Verifying  : fontconfig-2.13.0-4.3.el7.x86_64                            4/61 
[00:01:46]   Verifying  : dos2unix-6.0.3-7.el7.x86_64                                 5/61 
[00:01:46]   Verifying  : giflib-4.1.6-9.el7.x86_64                                   6/61 
[00:01:46]   Verifying  : libxshmfence-1.2-1.el7.x86_64                               7/61 
[00:01:46]   Verifying  : libXrender-0.9.10-1.el7.x86_64                              8/61 
[00:01:46]   Verifying  : log4net-1.2.15-4.el7.x86_64                                 9/61 
[00:01:46]   Verifying  : libXxf86vm-1.1.4-1.el7.x86_64                              10/61 
[00:01:46]   Verifying  : mono-wcf-5.18.0-1.el7.x86_64                               11/61 
[00:01:47]   Verifying  : libunistring-0.9.3-9.el7.x86_64                            12/61 
[00:01:47]   Verifying  : pcre-devel-8.32-17.el7.x86_64                              13/61 
[00:01:47]   Verifying  : 1:nant-0.92-15.el7.x86_64                                  14/61 
[00:01:47]   Verifying  : mesa-libGL-18.0.5-4.el7_6.x86_64                           15/61 
[00:01:47]   Verifying  : libpciaccess-0.14-1.el7.x86_64                             16/61 
[00:01:47]   Verifying  : libICE-1.0.9-9.el7.x86_64                                  17/61 
[00:01:47]   Verifying  : libX11-common-1.6.5-2.el7.noarch                           18/61 
[00:01:47]   Verifying  : fontpackages-filesystem-1.44-8.el7.noarch                  19/61 
[00:01:47]   Verifying  : gettext-libs-0.19.8.1-2.el7.x86_64                         20/61 
[00:01:47]   Verifying  : libjpeg-turbo-1.2.90-6.el7.x86_64                          21/61 
[00:01:47]   Verifying  : mono-data-5.18.0-1.el7.x86_64                              22/61 
[00:01:47]   Verifying  : libwayland-client-1.15.0-1.el7.x86_64                      23/61 
[00:01:47]   Verifying  : libcroco-0.6.12-4.el7.x86_64                               24/61 
[00:01:47]   Verifying  : mono-data-sqlite-5.18.0-1.el7.x86_64                       25/61 
[00:01:47]   Verifying  : nunit2-2.6.4-14.el7.x86_64                                 26/61 
[00:01:47]   Verifying  : 2:libpng-1.5.13-7.el7_2.x86_64                             27/61 
[00:01:47]   Verifying  : libdrm-2.4.91-3.el7.x86_64                                 28/61 
[00:01:47]   Verifying  : gettext-0.19.8.1-2.el7.x86_64                              29/61 
[00:01:47]   Verifying  : mesa-libgbm-18.0.5-4.el7_6.x86_64                          30/61 
[00:01:47]   Verifying  : libgdiplus-devel-2.10-10.el7.x86_64                        31/61 
[00:01:47]   Verifying  : 1:libglvnd-1.0.1-0.8.git5baa1e5.el7.x86_64                 32/61 
[00:01:47]   Verifying  : glib2-devel-2.56.1-2.el7.x86_64                            33/61 
[00:01:47]   Verifying  : hwdata-0.252-9.1.el7.x86_64                                34/61 
[00:01:47]   Verifying  : mesa-libEGL-18.0.5-4.el7_6.x86_64                          35/61 
[00:01:47]   Verifying  : 1:libglvnd-glx-1.0.1-0.8.git5baa1e5.el7.x86_64             36/61 
[00:01:47]   Verifying  : libxcb-1.13-1.el7.x86_64                                   37/61 
[00:01:47]   Verifying  : libX11-1.6.5-2.el7.x86_64                                  38/61 
[00:01:47]   Verifying  : mono-winforms-5.18.0-1.el7.x86_64                          39/61 
[00:01:47]   Verifying  : dejavu-sans-fonts-2.33-6.el7.noarch                        40/61 
[00:01:47]   Verifying  : 1:liberation-mono-fonts-1.07.2-16.el7.noarch               41/61 
[00:01:47]   Verifying  : pixman-0.34.0-1.el7.x86_64                                 42/61 
[00:01:47]   Verifying  : jbigkit-libs-2.0-11.el7.x86_64                             43/61 
[00:01:47]   Verifying  : mono-devel-5.18.0-1.el7.x86_64                             44/61 
[00:01:47]   Verifying  : monodoc-5.18.0-1.el7.x86_64                                45/61 
[00:01:47]   Verifying  : cairo-1.15.12-3.el7.x86_64                                 46/61 
[00:01:47]   Verifying  : libwayland-server-1.15.0-1.el7.x86_64                      47/61 
[00:01:47]   Verifying  : mesa-libglapi-18.0.5-4.el7_6.x86_64                        48/61 
[00:01:47]   Verifying  : dejavu-fonts-common-2.33-6.el7.noarch                      49/61 
[00:01:47]   Verifying  : libexif-0.6.21-6.el7.x86_64                                50/61 
[00:01:47]   Verifying  : libXau-1.0.8-2.1.el7.x86_64                                51/61 
[00:01:47]   Verifying  : mono-core-5.18.0-1.el7.x86_64                              52/61 
[00:01:47]   Verifying  : 1:libglvnd-egl-1.0.1-0.8.git5baa1e5.el7.x86_64             53/61 
[00:01:47]   Verifying  : mono-mvc-5.18.0-1.el7.x86_64                               54/61 
[00:01:47]   Verifying  : mono-web-5.18.0-1.el7.x86_64                               55/61 
[00:01:47]   Verifying  : 1:liberation-fonts-common-1.07.2-16.el7.noarch             56/61 
[00:01:47]   Verifying  : freetype-2.8-12.el7_6.1.x86_64                             57/61 
[00:01:47]   Verifying  : libXdamage-1.1.4-4.1.el7.x86_64                            58/61 
[00:01:47]   Verifying  : libXfixes-5.0.3-1.el7.x86_64                               59/61 
[00:01:47]   Verifying  : mono-extras-5.18.0-1.el7.x86_64                            60/61 
[00:01:47]   Verifying  : libSM-1.2.2-2.el7.x86_64                                   61/61 
[00:01:47] 
[00:01:47] Installed:
[00:01:47]   dos2unix.x86_64 0:6.0.3-7.el7                                                 
[00:01:47]   gettext.x86_64 0:0.19.8.1-2.el7                                               
[00:01:47]   liberation-mono-fonts.noarch 1:1.07.2-16.el7                                  
[00:01:47]   libgdiplus-devel.x86_64 0:2.10-10.el7                                         
[00:01:47]   mono-devel.x86_64 0:5.18.0-1.el7                                              
[00:01:47]   mono-mvc.x86_64 0:5.18.0-1.el7                                                
[00:01:47]   mono-wcf.x86_64 0:5.18.0-1.el7                                                
[00:01:47]   nant.x86_64 1:0.92-15.el7                                                     
[00:01:47] 
[00:01:47] Dependency Installed:
[00:01:47]   cairo.x86_64 0:1.15.12-3.el7                                                  
[00:01:47]   dejavu-fonts-common.noarch 0:2.33-6.el7                                       
[00:01:47]   dejavu-sans-fonts.noarch 0:2.33-6.el7                                         
[00:01:47]   fontconfig.x86_64 0:2.13.0-4.3.el7                                            
[00:01:47]   fontpackages-filesystem.noarch 0:1.44-8.el7                                   
[00:01:47]   freetype.x86_64 0:2.8-12.el7_6.1                                              
[00:01:47]   gettext-libs.x86_64 0:0.19.8.1-2.el7                                          
[00:01:47]   giflib.x86_64 0:4.1.6-9.el7                                                   
[00:01:47]   glib2-devel.x86_64 0:2.56.1-2.el7                                             
[00:01:47]   hwdata.x86_64 0:0.252-9.1.el7                                                 
[00:01:47]   jbigkit-libs.x86_64 0:2.0-11.el7                                              
[00:01:47]   libICE.x86_64 0:1.0.9-9.el7                                                   
[00:01:47]   libSM.x86_64 0:1.2.2-2.el7                                                    
[00:01:47]   libX11.x86_64 0:1.6.5-2.el7                                                   
[00:01:47]   libX11-common.noarch 0:1.6.5-2.el7                                            
[00:01:47]   libXau.x86_64 0:1.0.8-2.1.el7                                                 
[00:01:47]   libXdamage.x86_64 0:1.1.4-4.1.el7                                             
[00:01:47]   libXext.x86_64 0:1.3.3-3.el7                                                  
[00:01:47]   libXfixes.x86_64 0:5.0.3-1.el7                                                
[00:01:47]   libXrender.x86_64 0:0.9.10-1.el7                                              
[00:01:47]   libXxf86vm.x86_64 0:1.1.4-1.el7                                               
[00:01:47]   libcroco.x86_64 0:0.6.12-4.el7                                                
[00:01:47]   libdrm.x86_64 0:2.4.91-3.el7                                                  
[00:01:47]   liberation-fonts-common.noarch 1:1.07.2-16.el7                                
[00:01:47]   libexif.x86_64 0:0.6.21-6.el7                                                 
[00:01:47]   libgdiplus.x86_64 0:2.10-10.el7                                               
[00:01:47]   libglvnd.x86_64 1:1.0.1-0.8.git5baa1e5.el7                                    
[00:01:47]   libglvnd-egl.x86_64 1:1.0.1-0.8.git5baa1e5.el7                                
[00:01:47]   libglvnd-glx.x86_64 1:1.0.1-0.8.git5baa1e5.el7                                
[00:01:47]   libjpeg-turbo.x86_64 0:1.2.90-6.el7                                           
[00:01:47]   libpciaccess.x86_64 0:0.14-1.el7                                              
[00:01:47]   libpng.x86_64 2:1.5.13-7.el7_2                                                
[00:01:47]   libtiff.x86_64 0:4.0.3-27.el7_3                                               
[00:01:47]   libunistring.x86_64 0:0.9.3-9.el7                                             
[00:01:47]   libwayland-client.x86_64 0:1.15.0-1.el7                                       
[00:01:47]   libwayland-server.x86_64 0:1.15.0-1.el7                                       
[00:01:47]   libxcb.x86_64 0:1.13-1.el7                                                    
[00:01:47]   libxshmfence.x86_64 0:1.2-1.el7                                               
[00:01:47]   log4net.x86_64 0:1.2.15-4.el7                                                 
[00:01:47]   mesa-libEGL.x86_64 0:18.0.5-4.el7_6                                           
[00:01:47]   mesa-libGL.x86_64 0:18.0.5-4.el7_6                                            
[00:01:47]   mesa-libgbm.x86_64 0:18.0.5-4.el7_6                                           
[00:01:47]   mesa-libglapi.x86_64 0:18.0.5-4.el7_6                                         
[00:01:47]   mono-core.x86_64 0:5.18.0-1.el7                                               
[00:01:47]   mono-data.x86_64 0:5.18.0-1.el7                                               
[00:01:47]   mono-data-sqlite.x86_64 0:5.18.0-1.el7                                        
[00:01:47]   mono-extras.x86_64 0:5.18.0-1.el7                                             
[00:01:47]   mono-web.x86_64 0:5.18.0-1.el7                                                
[00:01:47]   mono-winforms.x86_64 0:5.18.0-1.el7                                           
[00:01:47]   monodoc.x86_64 0:5.18.0-1.el7                                                 
[00:01:47]   nunit2.x86_64 0:2.6.4-14.el7                                                  
[00:01:47]   pcre-devel.x86_64 0:8.32-17.el7                                               
[00:01:47]   pixman.x86_64 0:0.34.0-1.el7                                                  
[00:01:47] 
[00:01:47] Complete!
[00:01:47] 0
[00:01:47] now running: ssh -f -o "StrictHostKeyChecking no" -o Port=22 -i /etc/lightbuildserver/container/container_rsa root@10.0.3.5 "export LC_ALL=C; (mydevice=\`ip -o route get to 8.8.8.8 | awk '{ print \$5 }'\`; myip=\`ip -o route get to 8.8.8.8 | awk '{ print \$7 }'\`; ip route add \$myip dev \$mydevice) 2>&1 && echo \$?"
[00:01:47] 0
[00:01:47] now running: ssh -f -o "StrictHostKeyChecking no" -o Port=22 -i /etc/lightbuildserver/container/container_rsa root@10.0.3.5 "export LC_ALL=C; (sed -i "s/0%{?suse_version}/0/g" lbs-openpetra/openpetranow-mysql-test/openpetranow-mysql-test.spec) 2>&1 && echo \$?"
[00:01:47] 0
[00:01:47] now running: ssh -f -o "StrictHostKeyChecking no" -o Port=22 -i /etc/lightbuildserver/container/container_rsa root@10.0.3.5 "export LC_ALL=C; (cp lbs-openpetra/openpetranow-mysql-test/openpetranow-mysql-test.spec rpmbuild/SPECS) 2>&1 && echo \$?"
[00:01:47] 0
[00:01:47] now running: ssh -f -o "StrictHostKeyChecking no" -o Port=22 -i /etc/lightbuildserver/container/container_rsa root@10.0.3.5 "export LC_ALL=C; (cp lbs-openpetra/openpetranow-mysql-test/* rpmbuild/SOURCES) 2>&1 && echo \$?"
[00:01:48] cp: omitting directory 'lbs-openpetra/openpetranow-mysql-test/openpetra-client-js-test'
[00:01:48] now running: ssh -f -o "StrictHostKeyChecking no" -o Port=22 -i /etc/lightbuildserver/container/container_rsa root@10.0.3.5 "export LC_ALL=C; (mv sources/* rpmbuild/SOURCES) 2>&1 && echo \$?"
[00:01:48] 0
[00:01:48] now running: rsync -avz -e "ssh -i /etc/lightbuildserver/container/container_rsa -p 2222" root@build04lxc.lbs.solidcharity.com:/var/lib/lxc/005-build04lxc.lbs.solidcharity.com/rootfs/root/rpmbuild/SPECS/openpetranow-mysql-test.spec /tmp/tmpjbuamwb6
[00:01:48] receiving incremental file list
[00:01:48] openpetranow-mysql-test.spec
[00:01:48] 
[00:01:48] sent 43 bytes  received 1,864 bytes  1,271.33 bytes/sec
[00:01:48] total size is 5,417  speedup is 2.84
[00:01:48] now running: ssh -f -o "StrictHostKeyChecking no" -o Port=22 -i /etc/lightbuildserver/container/container_rsa root@10.0.3.5 "export LC_ALL=C; (sed -i -e 's/Release:.*%{release}/Release: 2/g' rpmbuild/SPECS/openpetranow-mysql-test.spec) 2>&1 && echo \$?"
[00:01:48] 0
[00:01:48] now running: ssh -f -o "StrictHostKeyChecking no" -o Port=22 -i /etc/lightbuildserver/container/container_rsa root@10.0.3.5 "export LC_ALL=C; (rpmbuild -ba rpmbuild/SPECS/openpetranow-mysql-test.spec) 2>&1 && echo \$?"
[00:01:48] Executing(%prep): /bin/sh -e /var/tmp/rpm-tmp.BTsJ5Q
[00:01:48] + umask 022
[00:01:48] + cd /root/rpmbuild/BUILD
[00:01:48] + '[' -d /root/rpmbuild/BUILDROOT/openpetranow-mysql-test-2019.02.0-2.x86_64 ']'
[00:01:48] + cd /root/rpmbuild/BUILD
[00:01:48] + rm -rf openpetra-test
[00:01:48] + /usr/bin/gzip -dc /root/rpmbuild/SOURCES/sources.tar.gz
[00:01:48] + /usr/bin/tar -xf -
[00:01:49] + STATUS=0
[00:01:49] + '[' 0 -ne 0 ']'
[00:01:49] + cd openpetra-test
[00:01:49] + /usr/bin/chmod -Rf a+rX,u+w,g-w,o-w .
[00:01:49] + tar xzf /root/rpmbuild/SOURCES/sources-client.tar.gz
[00:01:49] + mv openpetra-client-js-test ../openpetra-client
[00:01:49] + tar xzf /root/rpmbuild/SOURCES/i18n.tar.gz
[00:01:50] + mv openpetra-i18n-master/i18n/de.po i18n/de_DE.po
[00:01:50] + mv openpetra-i18n-master/i18n/es.po i18n/es_ES.po
[00:01:50] + mv openpetra-i18n-master/i18n/da.po i18n/da_DK.po
[00:01:50] + exit 0
[00:01:50] Executing(%build): /bin/sh -e /var/tmp/rpm-tmp.aHCX0W
[00:01:50] + umask 022
[00:01:50] + cd /root/rpmbuild/BUILD
[00:01:50] + cd openpetra-test
[00:01:50] + nant buildRPM -D:ReleaseID=2019.02.0.2 -D:LinuxTargetDistribution-list=centos-mysql -D:DBMS.Type=mysql
[00:01:50] NAnt 0.92 (Build 0.92.4543.0; release; 06/09/2012)
[00:01:50] Copyright (C) 2001-2012 Gerry Shaw
[00:01:50] http://nant.sourceforge.net
[00:01:50] 
[00:01:50] Buildfile: file:///root/rpmbuild/BUILD/openpetra-test/OpenPetra.build
[00:01:50] Target framework: Mono 4.0 Profile
[00:01:50] Target(s) specified: buildRPM 
[00:01:50] 
[00:01:50]      [echo] operating system=Unix 4.15.0.43
[00:01:50]      [echo] platform=unix
[00:01:51]     [mkdir] Creating directory '/root/rpmbuild/BUILD/openpetra-test/tmp'.
[00:01:51]     [mkdir] Creating directory '/root/rpmbuild/BUILD/openpetra-test/log'.
[00:01:51]     [mkdir] Creating directory '/root/rpmbuild/BUILD/openpetra-test/var'.
[00:01:52]      [echo] Running on Unix
[00:01:52]     [mkdir] Creating directory '/root/rpmbuild/BUILD/openpetra-test/delivery/db'.
[00:01:53] 
[00:01:53] buildRPM:
[00:01:53] 
[00:01:53] 
[00:01:53] nanttasks:
[00:01:53] 
[00:01:53]      [echo] Target nanttasks started at: 02/02/2019 22:41:04
[00:01:53]      [nant] /root/rpmbuild/BUILD/openpetra-test/inc/nanttasks/nanttasks.build compile
[00:01:53]             Buildfile: file:///root/rpmbuild/BUILD/openpetra-test/inc/nanttasks/nanttasks.build
[00:01:53]             Target framework: Mono 4.0 Profile
[00:01:53]             Target(s) specified: compile 
[00:01:53]             
[00:01:54]             
[00:01:54]             custdepend:
[00:01:54]             
[00:01:54]                   [csc] Compiling 9 files to '/root/rpmbuild/BUILD/openpetra-test/delivery/bin/Ict.Tools.NAntTasks.dll'.
[00:01:55]             
[00:01:55]             compile:
[00:01:55]             
[00:01:55]             
[00:01:55]             BUILD SUCCEEDED
[00:01:55]             
[00:01:55]             Total time: 1.8 seconds.
[00:01:55]             
[00:01:55]      [echo] Target nanttasks finished at: 02/02/2019 22:41:06
[00:01:55] 
[00:01:55] minimalGenerateSolution:
[00:01:55] 
[00:01:55]      [echo] Target minimalGenerateSolution started at: 02/02/2019 22:41:06
[00:01:55] 
[00:01:55] generateTools:
[00:01:55] 
[00:01:55]      [echo] Target generateTools started at: 02/02/2019 22:41:06
[00:01:55] 
[00:01:55] nanttasks:
[00:01:55] 
[00:01:55]      [echo] Target nanttasks started at: 02/02/2019 22:41:06
[00:01:55]      [nant] /root/rpmbuild/BUILD/openpetra-test/inc/nanttasks/nanttasks.build compile
[00:01:55]             Buildfile: file:///root/rpmbuild/BUILD/openpetra-test/inc/nanttasks/nanttasks.build
[00:01:55]             Target framework: Mono 4.0 Profile
[00:01:55]             Target(s) specified: compile 
[00:01:55]             
[00:01:56]             
[00:01:56]             custdepend:
[00:01:56]             
[00:01:56]             
[00:01:56]             compile:
[00:01:56]             
[00:01:56]             
[00:01:56]             BUILD SUCCEEDED
[00:01:56]             
[00:01:56]             Total time: 1.1 seconds.
[00:01:56]             
[00:01:56]      [echo] Target nanttasks finished at: 02/02/2019 22:41:07
[00:01:56]      [echo] Starting GenerateNamespaceMap at 22:41:07
[00:01:56]      [echo] Completed parsing 499 files at 22:41:08
[00:01:56]      [echo] Completed NamespaceMap (234 items) and DllMap (11 items) at 22:41:08
[00:01:56]      [echo] Finished GenerateNamespaceMap at 22:41:08
[00:01:56]      [nant] /root/rpmbuild/BUILD/openpetra-test/csharp/ThirdParty/ThirdParty.build compile
[00:01:56]             Buildfile: file:///root/rpmbuild/BUILD/openpetra-test/csharp/ThirdParty/ThirdParty.build
[00:01:56]             Target framework: Mono 4.0 Profile
[00:01:56]             Target(s) specified: compile 
[00:01:56]             
[00:01:57]             
[00:01:57]             compile:
[00:01:57]             
[00:01:57]                  [echo] Target ThirdParty compile started at: 02/02/2019 22:41:09
[00:01:57]                  [copy] Copying 1 file to '/root/rpmbuild/BUILD/openpetra-test/delivery/bin'.
[00:01:57]                  [copy] Copying 1 file to '/root/rpmbuild/BUILD/openpetra-test/delivery/bin'.
[00:01:57]                  [copy] Copying 1 file to '/root/rpmbuild/BUILD/openpetra-test/delivery/bin'.
[00:01:57]                  [copy] Copying 2 files to '/root/rpmbuild/BUILD/openpetra-test/delivery/bin'.
[00:01:57]                  [copy] Copying 1 file to '/root/rpmbuild/BUILD/openpetra-test/delivery/bin'.
[00:01:57]                  [copy] Copying 2 files to '/root/rpmbuild/BUILD/openpetra-test/delivery/bin'.
[00:01:57]                  [copy] Copying 1 file to '/root/rpmbuild/BUILD/openpetra-test/delivery/bin'.
[00:01:57]                  [copy] Copying 1 file to '/root/rpmbuild/BUILD/openpetra-test/delivery/bin'.
[00:01:57]                  [copy] Copying 1 file to '/root/rpmbuild/BUILD/openpetra-test/delivery/bin'.
[00:01:57]                  [copy] Copying 3 files to '/root/rpmbuild/BUILD/openpetra-test/delivery/bin'.
[00:01:57]                  [copy] Copying 1 file to '/root/rpmbuild/BUILD/openpetra-test/delivery/bin'.
[00:01:57]                  [copy] Copying 1 file to '/root/rpmbuild/BUILD/openpetra-test/delivery/bin'.
[00:01:57]                  [copy] Copying 2 files to '/root/rpmbuild/BUILD/openpetra-test/delivery/bin'.
[00:01:57]                  [copy] Copying 3 files to '/root/rpmbuild/BUILD/openpetra-test/delivery/bin'.
[00:01:57]                  [echo] Target ThirdParty compile finished at: 02/02/2019 22:41:09
[00:01:57]             
[00:01:57]             BUILD SUCCEEDED
[00:01:57]             
[00:01:57]             Total time: 0.9 seconds.
[00:01:57]             
[00:01:57] 
[00:01:57] generateProjectFilesInternal:
[00:01:57] 
[00:01:57]      [echo] Target generateProjectFilesInternal started at: 02/02/2019 22:41:09
[00:01:57]      [echo] Target generateProjectFilesInternal finished at: 02/02/2019 22:41:09
[00:01:57] 
[00:01:57] quickCompile:
[00:01:57] 
[00:01:57]      [echo] Target quickCompile started at: 02/02/2019 22:41:09
[00:01:57] compiling OpenPetra.Tools
[00:01:57] Compiling /root/rpmbuild/BUILD/openpetra-test/csharp/ICT/Common/Ict.Common.csproj
[00:01:59] Compiling /root/rpmbuild/BUILD/openpetra-test/csharp/ICT/Common/IO/Ict.Common.IO.csproj
[00:02:00] Compiling /root/rpmbuild/BUILD/openpetra-test/csharp/ICT/Common/Session/Ict.Common.Session.csproj
[00:02:01] Compiling /root/rpmbuild/BUILD/openpetra-test/csharp/ICT/Common/DB/Ict.Common.DB.csproj
[00:02:02] Compiling /root/rpmbuild/BUILD/openpetra-test/csharp/ICT/BuildTools/DBXML/Ict.Tools.DBXML.csproj
[00:02:03] Compiling /root/rpmbuild/BUILD/openpetra-test/csharp/ICT/BuildTools/CodeGeneration/Ict.Tools.CodeGeneration.csproj
[00:02:04] Compiling /root/rpmbuild/BUILD/openpetra-test/csharp/ICT/BuildTools/GenerateSQL/Ict.Tools.GenerateSQL.csproj
[00:02:05] Compiling /root/rpmbuild/BUILD/openpetra-test/csharp/ICT/BuildTools/GenerateORM/Ict.Tools.GenerateORM.csproj
[00:02:06] Compiling /root/rpmbuild/BUILD/openpetra-test/csharp/ICT/BuildTools/GenerateI18N/Ict.Tools.GenerateI18N.csproj
[00:02:07] Compiling /root/rpmbuild/BUILD/openpetra-test/csharp/ICT/BuildTools/GenerateGlue/Ict.Tools.GenerateGlue.csproj
[00:02:08] Compiling /root/rpmbuild/BUILD/openpetra-test/csharp/ICT/BuildTools/CheckHtml/Ict.Tools.CheckHtml.csproj
[00:02:09]      [echo] Target quickCompile finished at: 02/02/2019 22:41:20
[00:02:09]      [echo] Target generateTools finished at: 02/02/2019 22:41:20
[00:02:09] 
[00:02:09] generateORMCachedTables:
[00:02:09] 
[00:02:09] [ExecDotNet] Writing Partner.Cacheable-generated.cs
[00:02:09] [ExecDotNet] Writing Mailing.Cacheable-generated.cs
[00:02:09] [ExecDotNet] Writing Subscriptions.Cacheable-generated.cs
[00:02:09] [ExecDotNet] Writing MPartner.Cacheable-generated.cs
[00:02:09] [ExecDotNet] Writing Cacheable-generated.cs
[00:02:09] [ExecDotNet] Writing MCommon.Cacheable-generated.cs
[00:02:09] [ExecDotNet] Writing Unit.Cacheable-generated.cs
[00:02:10] [ExecDotNet] Writing Person.Cacheable-generated.cs
[00:02:10] [ExecDotNet] Writing MPersonnel.Cacheable-generated.cs
[00:02:10] [ExecDotNet] Writing Cacheable-generated.cs
[00:02:10] [ExecDotNet] Writing MFinance.Cacheable-generated.cs
[00:02:10] [ExecDotNet] Writing Cacheable-generated.cs
[00:02:10] [ExecDotNet] Writing MConference.Cacheable-generated.cs
[00:02:10] [ExecDotNet] Writing Cacheable-generated.cs
[00:02:10] [ExecDotNet] Writing MSysMan.Cacheable-generated.cs
[00:02:10]      [echo] now run: nant quickCompile -D:onlyonce=true
[00:02:10] 
[00:02:10] generateORMData:
[00:02:10] 
[00:02:10]      [echo] Target generateORMData started at: 02/02/2019 22:41:21
[00:02:10]      [nant] /root/rpmbuild/BUILD/openpetra-test/csharp/ICT/Petra/Shared/Ict.Petra.Shared.build custdepend
[00:02:10]             Buildfile: file:///root/rpmbuild/BUILD/openpetra-test/csharp/ICT/Petra/Shared/Ict.Petra.Shared.build
[00:02:10]             Target framework: Mono 4.0 Profile
[00:02:10]             Target(s) specified: custdepend 
[00:02:10]             
[00:02:11]             
[00:02:11]             custdepend:
[00:02:11]             
[00:02:11]                 [mkdir] Creating directory '/root/rpmbuild/BUILD/openpetra-test/csharp/ICT/Petra/Shared/lib/data'.
[00:02:11]                 [mkdir] Creating directory '/root/rpmbuild/BUILD/openpetra-test/csharp/ICT/Petra/Shared/lib/MHospitality/validation'.
[00:02:11]             [ExecDotNet] processing namespace Typed Tables Partner
[00:02:13]             [ExecDotNet] Writing Partner.Tables-generated.cs
[00:02:13]             [ExecDotNet] processing namespace Typed Tables Mailroom
[00:02:14]             [ExecDotNet] Writing Mailroom.Tables-generated.cs
[00:02:14]             [ExecDotNet] processing namespace Typed Tables Personnel
[00:02:16]             [ExecDotNet] Writing Personnel.Tables-generated.cs
[00:02:16]             [ExecDotNet] processing namespace Typed Tables Units
[00:02:16]             [ExecDotNet] Writing Units.Tables-generated.cs
[00:02:16]             [ExecDotNet] processing namespace Typed Tables Conference
[00:02:16]             [ExecDotNet] Writing Conference.Tables-generated.cs
[00:02:16]             [ExecDotNet] processing namespace Typed Tables Hospitality
[00:02:17]             [ExecDotNet] Writing Hospitality.Tables-generated.cs
[00:02:17]             [ExecDotNet] processing namespace Typed Tables Account
[00:02:19]             [ExecDotNet] Writing Account.Tables-generated.cs
[00:02:19]             [ExecDotNet] processing namespace Typed Tables Ap
[00:02:19]             [ExecDotNet] Writing AP.Tables-generated.cs
[00:02:19]             [ExecDotNet] processing namespace Typed Tables Ar
[00:02:19]             [ExecDotNet] Writing AR.Tables-generated.cs
[00:02:19]             [ExecDotNet] processing namespace Typed Tables Gift
[00:02:20]             [ExecDotNet] Writing Gift.Tables-generated.cs
[00:02:20]             [ExecDotNet] processing namespace Typed Tables Sysman
[00:02:21]             [ExecDotNet] Writing SysMan.Tables-generated.cs
[00:02:21]             [ExecDotNet] processing namespace Typed Tables Common
[00:02:21]             [ExecDotNet] Writing Common.Tables-generated.cs
[00:02:21]             [ExecDotNet] processing validation of Typed Tables Partner
[00:02:22]             [ExecDotNet] Writing Partner.Validation-generated.cs
[00:02:22]             [ExecDotNet] processing validation of Typed Tables Mailroom
[00:02:22]             [ExecDotNet] Writing Mailroom.Validation-generated.cs
[00:02:22]             [ExecDotNet] processing validation of Typed Tables Personnel
[00:02:23]             [ExecDotNet] Writing Personnel.Validation-generated.cs
[00:02:23]             [ExecDotNet] processing validation of Typed Tables Units
[00:02:23]             [ExecDotNet] Writing Units.Validation-generated.cs
[00:02:23]             [ExecDotNet] processing validation of Typed Tables Conference
[00:02:23]             [ExecDotNet] Writing Conference.Validation-generated.cs
[00:02:23]             [ExecDotNet] processing validation of Typed Tables Hospitality
[00:02:23]             [ExecDotNet] Writing Hospitality.Validation-generated.cs
[00:02:23]             [ExecDotNet] processing validation of Typed Tables Account
[00:02:23]             [ExecDotNet] Writing Account.Validation-generated.cs
[00:02:23]             [ExecDotNet] processing validation of Typed Tables Ap
[00:02:23]             [ExecDotNet] Writing AP.Validation-generated.cs
[00:02:23]             [ExecDotNet] processing validation of Typed Tables Ar
[00:02:23]             [ExecDotNet] Writing AR.Validation-generated.cs
[00:02:23]             [ExecDotNet] processing validation of Typed Tables Gift
[00:02:24]             [ExecDotNet] Writing Gift.Validation-generated.cs
[00:02:24]             [ExecDotNet] processing validation of Typed Tables Sysman
[00:02:24]             [ExecDotNet] Writing SysMan.Validation-generated.cs
[00:02:24]             [ExecDotNet] processing validation of Typed Tables Common
[00:02:24]             [ExecDotNet] Writing Common.Validation-generated.cs
[00:02:24]             [ExecDotNet] Writing TableList-generated.cs
[00:02:25]             [ExecDotNet] processing dataset Ict.Petra.Shared.MCommon.Data
[00:02:25]             [ExecDotNet] Writing Common.DataSets-generated.cs
[00:02:25]             [ExecDotNet] processing dataset Ict.Petra.Shared.MPartner.Partner.Data
[00:02:26]             [ExecDotNet] Writing Partner.DataSets-generated.cs
[00:02:27]             [ExecDotNet] processing dataset Ict.Petra.Shared.MPersonnel.Personnel.Data
[00:02:27]             [ExecDotNet] Writing Personnel.DataSets-generated.cs
[00:02:28]             [ExecDotNet] processing dataset Ict.Petra.Shared.MHospitality.Data
[00:02:28]             [ExecDotNet] Writing Hospitality.DataSets-generated.cs
[00:02:29]             [ExecDotNet] processing dataset Ict.Petra.Shared.MFinance.AP.Data
[00:02:29]             [ExecDotNet] Writing Finance.AP.DataSets-generated.cs
[00:02:29]             [ExecDotNet] processing dataset Ict.Petra.Shared.MFinance.GL.Data
[00:02:30]             [ExecDotNet] Writing Finance.GL.DataSets-generated.cs
[00:02:30]             [ExecDotNet] processing dataset Ict.Petra.Shared.MFinance.Gift.Data
[00:02:30]             [ExecDotNet] Writing Finance.Gift.DataSets-generated.cs
[00:02:31]             [ExecDotNet] processing dataset Ict.Petra.Shared.MSysMan.Data
[00:02:31]             [ExecDotNet] Writing SysMan.DataSets-generated.cs
[00:02:32]             [ExecDotNet] processing dataset Ict.Petra.Shared.MConference.Data
[00:02:32]             [ExecDotNet] Writing Conference.DataSets-generated.cs
[00:02:32]             [ExecDotNet] processing dataset Ict.Petra.Shared.MFinance.CrossLedger.Data
[00:02:32]             [ExecDotNet] Writing Finance.CrossLedger.DataSets-generated.cs
[00:02:33]             [ExecDotNet] processing dataset Ict.Petra.Shared.MFinance.BankImport.Data
[00:02:33]             [ExecDotNet] Writing Finance.BankImport.DataSets-generated.cs
[00:02:33]             
[00:02:33]             BUILD SUCCEEDED
[00:02:33]             
[00:02:33]             Total time: 23.6 seconds.
[00:02:33]             
[00:02:33]      [nant] /root/rpmbuild/BUILD/openpetra-test/csharp/ICT/Petra/Plugins/Plugins.build custdependORM
[00:02:33]             Buildfile: file:///root/rpmbuild/BUILD/openpetra-test/csharp/ICT/Petra/Plugins/Plugins.build
[00:02:33]             Target framework: Mono 4.0 Profile
[00:02:33]             Target(s) specified: custdependORM 
[00:02:33]             
[00:02:35]                  [echo] Running on Unix
[00:02:36]             
[00:02:36]             custdependORM:
[00:02:36]             
[00:02:36]             
[00:02:36]             BUILD SUCCEEDED
[00:02:36]             
[00:02:36]             Total time: 2.3 seconds.
[00:02:36]             
[00:02:36]      [echo] now run: nant quickCompile -D:onlyonce=true
[00:02:36]      [echo] Target generateORMData finished at: 02/02/2019 22:41:47
[00:02:36] 
[00:02:36] generateORMAccess:
[00:02:36] 
[00:02:36]      [echo] Target generateORMAccess started at: 02/02/2019 22:41:47
[00:02:36]      [nant] /root/rpmbuild/BUILD/openpetra-test/csharp/ICT/Petra/Server/Ict.Petra.Server.build custdepend
[00:02:36]             Buildfile: file:///root/rpmbuild/BUILD/openpetra-test/csharp/ICT/Petra/Server/Ict.Petra.Server.build
[00:02:36]             Target framework: Mono 4.0 Profile
[00:02:36]             Target(s) specified: custdepend 
[00:02:36]             
[00:02:37]             
[00:02:37]             custdepend:
[00:02:37]             
[00:02:37]                 [mkdir] Creating directory '/root/rpmbuild/BUILD/openpetra-test/csharp/ICT/Petra/Server/lib/data'.
[00:02:37]                 [mkdir] Creating directory '/root/rpmbuild/BUILD/openpetra-test/csharp/ICT/Petra/Server/lib/MFinance/web'.
[00:02:37]                 [mkdir] Creating directory '/root/rpmbuild/BUILD/openpetra-test/csharp/ICT/Petra/Server/lib/MReporting/web'.
[00:02:37]                 [mkdir] Creating directory '/root/rpmbuild/BUILD/openpetra-test/csharp/ICT/Petra/Server/lib/MCommon/connect'.
[00:02:37]                 [mkdir] Creating directory '/root/rpmbuild/BUILD/openpetra-test/csharp/ICT/Petra/Server/lib/MConference/connect'.
[00:02:37]                 [mkdir] Creating directory '/root/rpmbuild/BUILD/openpetra-test/csharp/ICT/Petra/Server/lib/MFinDev/connect'.
[00:02:37]                 [mkdir] Creating directory '/root/rpmbuild/BUILD/openpetra-test/csharp/ICT/Petra/Server/lib/MPersonnel/connect'.
[00:02:37]                 [mkdir] Creating directory '/root/rpmbuild/BUILD/openpetra-test/csharp/ICT/Petra/Server/lib/MSysMan/connect'.
[00:02:37]             [ExecDotNet] processing namespace PetraTypedDataAccess.Partner
[00:02:40]             [ExecDotNet] Writing Partner.Access-generated.cs
[00:02:40]             [ExecDotNet] processing namespace PetraTypedDataAccess.Mailroom
[00:02:41]             [ExecDotNet] Writing Mailroom.Access-generated.cs
[00:02:41]             [ExecDotNet] processing namespace PetraTypedDataAccess.Personnel
[00:02:42]             [ExecDotNet] Writing Personnel.Access-generated.cs
[00:02:42]             [ExecDotNet] processing namespace PetraTypedDataAccess.Units
[00:02:43]             [ExecDotNet] Writing Units.Access-generated.cs
[00:02:43]             [ExecDotNet] processing namespace PetraTypedDataAccess.Conference
[00:02:43]             [ExecDotNet] Writing Conference.Access-generated.cs
[00:02:43]             [ExecDotNet] processing namespace PetraTypedDataAccess.Hospitality
[00:02:43]             [ExecDotNet] Writing Hospitality.Access-generated.cs
[00:02:43]             [ExecDotNet] processing namespace PetraTypedDataAccess.Account
[00:02:45]             [ExecDotNet] Writing Account.Access-generated.cs
[00:02:45]             [ExecDotNet] processing namespace PetraTypedDataAccess.Ap
[00:02:46]             [ExecDotNet] Writing AP.Access-generated.cs
[00:02:46]             [ExecDotNet] processing namespace PetraTypedDataAccess.Ar
[00:02:46]             [ExecDotNet] Writing AR.Access-generated.cs
[00:02:46]             [ExecDotNet] processing namespace PetraTypedDataAccess.Gift
[00:02:47]             [ExecDotNet] Writing Gift.Access-generated.cs
[00:02:47]             [ExecDotNet] processing namespace PetraTypedDataAccess.Sysman
[00:02:49]             [ExecDotNet] Writing SysMan.Access-generated.cs
[00:02:49]             [ExecDotNet] processing namespace PetraTypedDataAccess.Common
[00:02:49]             [ExecDotNet] Writing Common.Access-generated.cs
[00:02:49]             [ExecDotNet] writing namespace Ict.Petra.Server.MCommon.Data.Cascading
[00:02:54]             [ExecDotNet] Writing Cascading-generated.cs
[00:02:55]             [ExecDotNet] processing dataset Ict.Petra.Server.MCommon.Data
[00:02:55]             [ExecDotNet] Writing Common.DataSets.Access-generated.cs
[00:02:56]             [ExecDotNet] processing dataset Ict.Petra.Server.MPartner.Partner.Data
[00:02:57]             [ExecDotNet] Writing Partner.DataSets.Access-generated.cs
[00:02:57]             [ExecDotNet] processing dataset Ict.Petra.Server.MPersonnel.Personnel.Data
[00:02:57]             [ExecDotNet] Writing Personnel.DataSets.Access-generated.cs
[00:02:58]             [ExecDotNet] processing dataset Ict.Petra.Server.MHospitality.Data
[00:02:58]             [ExecDotNet] Writing Hospitality.DataSets.Access-generated.cs
[00:02:59]             [ExecDotNet] processing dataset Ict.Petra.Server.MFinance.AP.Data
[00:02:59]             [ExecDotNet] Writing Finance.AP.DataSets.Access-generated.cs
[00:02:59]             [ExecDotNet] processing dataset Ict.Petra.Server.MFinance.GL.Data
[00:03:00]             [ExecDotNet] Writing Finance.GL.DataSets.Access-generated.cs
[00:03:00]             [ExecDotNet] processing dataset Ict.Petra.Server.MFinance.Gift.Data
[00:03:01]             [ExecDotNet] Writing Finance.Gift.DataSets.Access-generated.cs
[00:03:01]             [ExecDotNet] processing dataset Ict.Petra.Server.MSysMan.Data
[00:03:01]             [ExecDotNet] Writing SysMan.DataSets.Access-generated.cs
[00:03:02]             [ExecDotNet] processing dataset Ict.Petra.Server.MConference.Data
[00:03:02]             [ExecDotNet] Writing Conference.DataSets.Access-generated.cs
[00:03:03]             [ExecDotNet] processing dataset Ict.Petra.Server.MFinance.BankImport.Data
[00:03:03]             [ExecDotNet] Writing Finance.BankImport.DataSets.Access-generated.cs
[00:03:03]             
[00:03:03]             BUILD SUCCEEDED
[00:03:03]             
[00:03:03]             Total time: 26.9 seconds.
[00:03:03]             
[00:03:03]      [echo] now run: nant quickCompile -D:onlyonce=true
[00:03:03]      [echo] Target generateORMAccess finished at: 02/02/2019 22:42:14
[00:03:03] 
[00:03:03] generateORM:
[00:03:03] 
[00:03:03]      [echo] Target generateORM started at: 02/02/2019 22:42:14
[00:03:03]      [echo] please compile the code after the files have been regenerated
[00:03:03]      [echo] Target generateORM finished at: 02/02/2019 22:42:14
[00:03:03] 
[00:03:03] generateGlue:
[00:03:03] 
[00:03:03]      [nant] /root/rpmbuild/BUILD/openpetra-test/csharp/ICT/Petra/Plugins/Plugins.build custdependGlue
[00:03:03]             Buildfile: file:///root/rpmbuild/BUILD/openpetra-test/csharp/ICT/Petra/Plugins/Plugins.build
[00:03:03]             Target framework: Mono 4.0 Profile
[00:03:03]             Target(s) specified: custdependGlue 
[00:03:03]             
[00:03:04]                  [echo] Running on Unix
[00:03:05]             
[00:03:05]             custdependGlue:
[00:03:05]             
[00:03:05]             
[00:03:05]             BUILD SUCCEEDED
[00:03:05]             
[00:03:05]             Total time: 2.3 seconds.
[00:03:05]             
[00:03:05] [ExecDotNet] parsing all cs files for namespaces...
[00:03:06] [ExecDotNet] working on /root/rpmbuild/BUILD/openpetra-test/csharp/ICT/Petra/Server/app/WebService/ServerGlue.MCommon-generated.cs
[00:03:06] [ExecDotNet] Writing ServerGlue.MCommon-generated.cs
[00:03:06] [ExecDotNet] working on /root/rpmbuild/BUILD/openpetra-test/csharp/ICT/Petra/Server/app/WebService/ServerGlue.MConference-generated.cs
[00:03:06] [ExecDotNet] Writing ServerGlue.MConference-generated.cs
[00:03:06] [ExecDotNet] working on /root/rpmbuild/BUILD/openpetra-test/csharp/ICT/Petra/Server/app/WebService/ServerGlue.MFinance-generated.cs
[00:03:06] [ExecDotNet] Writing ServerGlue.MFinance-generated.cs
[00:03:06] [ExecDotNet] working on /root/rpmbuild/BUILD/openpetra-test/csharp/ICT/Petra/Server/app/WebService/ServerGlue.MFinDev-generated.cs
[00:03:06] [ExecDotNet] Writing ServerGlue.MFinDev-generated.cs
[00:03:06] [ExecDotNet] working on /root/rpmbuild/BUILD/openpetra-test/csharp/ICT/Petra/Server/app/WebService/ServerGlue.MHospitality-generated.cs
[00:03:06] [ExecDotNet] Writing ServerGlue.MHospitality-generated.cs
[00:03:06] [ExecDotNet] working on /root/rpmbuild/BUILD/openpetra-test/csharp/ICT/Petra/Server/app/WebService/ServerGlue.MPartner-generated.cs
[00:03:06] [ExecDotNet] Writing ServerGlue.MPartner-generated.cs
[00:03:06] [ExecDotNet] working on /root/rpmbuild/BUILD/openpetra-test/csharp/ICT/Petra/Server/app/WebService/ServerGlue.MPersonnel-generated.cs
[00:03:06] [ExecDotNet] Writing ServerGlue.MPersonnel-generated.cs
[00:03:06] [ExecDotNet] working on /root/rpmbuild/BUILD/openpetra-test/csharp/ICT/Petra/Server/app/WebService/ServerGlue.MReporting-generated.cs
[00:03:06] [ExecDotNet] Writing ServerGlue.MReporting-generated.cs
[00:03:06] [ExecDotNet] working on /root/rpmbuild/BUILD/openpetra-test/csharp/ICT/Petra/Server/app/WebService/ServerGlue.MSysMan-generated.cs
[00:03:06] [ExecDotNet] Writing ServerGlue.MSysMan-generated.cs
[00:03:07] [ExecDotNet] working on /root/rpmbuild/BUILD/openpetra-test/csharp/ICT/Petra/Server/app/WebService/ServerGlue.MServerAdmin-generated.cs
[00:03:07] [ExecDotNet] Writing ServerGlue.MServerAdmin-generated.cs
[00:03:07]      [echo] now run: nant quickCompile -D:onlyonce=true install.net
[00:03:07] 
[00:03:07] generateNamespaceMap:
[00:03:07] 
[00:03:07]      [echo] Target generateNamespaceMap started at: 02/02/2019 22:42:18
[00:03:07]      [echo] Starting GenerateNamespaceMap at 22:42:18
[00:03:09]      [echo] Completed parsing 594 files at 22:42:20
[00:03:09]      [echo] Completed NamespaceMap (315 items) and DllMap (121 items) at 22:42:20
[00:03:09]      [echo] Finished GenerateNamespaceMap at 22:42:21
[00:03:09]      [echo] Target generateNamespaceMap finished at: 02/02/2019 22:42:21
[00:03:09] 
[00:03:09] nanttasks:
[00:03:09] 
[00:03:09]      [echo] Target nanttasks started at: 02/02/2019 22:42:21
[00:03:09]      [nant] /root/rpmbuild/BUILD/openpetra-test/inc/nanttasks/nanttasks.build compile
[00:03:09]             Buildfile: file:///root/rpmbuild/BUILD/openpetra-test/inc/nanttasks/nanttasks.build
[00:03:09]             Target framework: Mono 4.0 Profile
[00:03:09]             Target(s) specified: compile 
[00:03:09]             
[00:03:10]             
[00:03:10]             custdepend:
[00:03:10]             
[00:03:10]             
[00:03:10]             compile:
[00:03:10]             
[00:03:10]             
[00:03:10]             BUILD SUCCEEDED
[00:03:10]             
[00:03:10]             Total time: 0.8 seconds.
[00:03:10]             
[00:03:10]      [echo] Target nanttasks finished at: 02/02/2019 22:42:21
[00:03:10] 
[00:03:10] generateNamespaceMap:
[00:03:10] 
[00:03:10]      [echo] Target generateNamespaceMap started at: 02/02/2019 22:42:21
[00:03:10]      [echo] Starting GenerateNamespaceMap at 22:42:21
[00:03:12]      [echo] Completed parsing 594 files at 22:42:23
[00:03:12]      [echo] Completed NamespaceMap (315 items) and DllMap (121 items) at 22:42:23
[00:03:12]      [echo] Finished GenerateNamespaceMap at 22:42:23
[00:03:12]      [echo] Target generateNamespaceMap finished at: 02/02/2019 22:42:23
[00:03:12] 
[00:03:12] generateProjectFilesInternal:
[00:03:12] 
[00:03:12]      [echo] Target generateProjectFilesInternal started at: 02/02/2019 22:42:23
[00:03:12]      [echo] Target generateProjectFilesInternal finished at: 02/02/2019 22:42:24
[00:03:12] 
[00:03:12] generateProjectFiles:
[00:03:12] 
[00:03:12]      [echo] Target minimalGenerateSolution finished at: 02/02/2019 22:42:24
[00:03:12] 
[00:03:12] quickCompile:
[00:03:12] 
[00:03:12]      [echo] Target quickCompile started at: 02/02/2019 22:42:24
[00:03:12] compiling OpenPetra.Server
[00:03:12] Skipping /root/rpmbuild/BUILD/openpetra-test/csharp/ICT/Common/Ict.Common.csproj
[00:03:12] Skipping /root/rpmbuild/BUILD/openpetra-test/csharp/ICT/Common/IO/Ict.Common.IO.csproj
[00:03:12] Compiling /root/rpmbuild/BUILD/openpetra-test/csharp/ICT/Common/Printing/Ict.Common.Printing.csproj
[00:03:13] Skipping /root/rpmbuild/BUILD/openpetra-test/csharp/ICT/Common/Session/Ict.Common.Session.csproj
[00:03:13] Skipping /root/rpmbuild/BUILD/openpetra-test/csharp/ICT/Common/DB/Ict.Common.DB.csproj
[00:03:13] Compiling /root/rpmbuild/BUILD/openpetra-test/csharp/ICT/Common/Verification/Ict.Common.Verification.csproj
[00:03:14] Compiling /root/rpmbuild/BUILD/openpetra-test/csharp/ICT/Common/Conversion/Ict.Common.Conversion.csproj
[00:03:15] Compiling /root/rpmbuild/BUILD/openpetra-test/csharp/ICT/Common/Data/Ict.Common.Data.csproj
[00:03:16] Compiling /root/rpmbuild/BUILD/openpetra-test/csharp/ICT/Common/Remoting/Shared/Ict.Common.Remoting.Shared.csproj
[00:03:17] Compiling /root/rpmbuild/BUILD/openpetra-test/csharp/ICT/Common/Remoting/Server/Ict.Common.Remoting.Server.csproj
[00:03:18] /root/rpmbuild/BUILD/openpetra-test/csharp/ICT/Common/Remoting/Server/ClientManager.cs(82,52) : warning CS0414: The private field `Ict.Common.Remoting.Server.TClientManager.UDelegateDBConnectionBroken' is assigned but its value is never used
[00:03:18] /root/rpmbuild/BUILD/openpetra-test/csharp/ICT/Common/Remoting/Server/ClientManager.cs(85,38) : warning CS0414: The private field `Ict.Common.Remoting.Server.TClientManager.UConnectClientMonitor' is assigned but its value is never used
[00:03:18] Compiling /root/rpmbuild/BUILD/openpetra-test/csharp/ICT/Common/Remoting/Client/Ict.Common.Remoting.Client.csproj
[00:03:19] Compiling /root/rpmbuild/BUILD/openpetra-test/csharp/ICT/Petra/Shared/lib/data/Ict.Petra.Shared.lib.data.csproj
[00:03:25] Compiling /root/rpmbuild/BUILD/openpetra-test/csharp/ICT/Petra/Shared/Ict.Petra.Shared.csproj
[00:03:26] Compiling /root/rpmbuild/BUILD/openpetra-test/csharp/ICT/Petra/Server/lib/data/Ict.Petra.Server.lib.data.csproj
[00:03:31] Compiling /root/rpmbuild/BUILD/openpetra-test/csharp/ICT/Petra/Server/app/Core/Ict.Petra.Server.app.Core.csproj
[00:03:33] Compiling /root/rpmbuild/BUILD/openpetra-test/csharp/ICT/Petra/Server/lib/MFinDev/web/Ict.Petra.Server.lib.MFinDev.web.csproj
[00:03:33] Compiling /root/rpmbuild/BUILD/openpetra-test/csharp/ICT/Petra/Server/lib/MHospitality/web/Ict.Petra.Server.lib.MHospitality.web.csproj
[00:03:34] Compiling /root/rpmbuild/BUILD/openpetra-test/csharp/ICT/Petra/Server/lib/MSysMan/Common/Ict.Petra.Server.lib.MSysMan.Common.csproj
[00:03:35] Compiling /root/rpmbuild/BUILD/openpetra-test/csharp/ICT/Petra/ServerAdmin/app/Core/Ict.Petra.ServerAdmin.app.Core.csproj
[00:03:36] Compiling /root/rpmbuild/BUILD/openpetra-test/csharp/ICT/Petra/Shared/lib/Interfaces/Ict.Petra.Shared.lib.Interfaces.csproj
[00:03:37] Compiling /root/rpmbuild/BUILD/openpetra-test/csharp/ICT/Petra/Shared/lib/MCommon/Ict.Petra.Shared.lib.MCommon.csproj
[00:03:38] Compiling /root/rpmbuild/BUILD/openpetra-test/csharp/ICT/Petra/Server/lib/MCommon/web/Ict.Petra.Server.lib.MCommon.web.csproj
[00:03:38] Compiling /root/rpmbuild/BUILD/openpetra-test/csharp/ICT/Petra/Shared/lib/MCommon/validation/Ict.Petra.Shared.lib.MCommon.validation.csproj
[00:03:39] Compiling /root/rpmbuild/BUILD/openpetra-test/csharp/ICT/Petra/Shared/lib/MConference/Ict.Petra.Shared.lib.MConference.csproj
[00:03:40] Compiling /root/rpmbuild/BUILD/openpetra-test/csharp/ICT/Petra/Shared/lib/MConference/validation/Ict.Petra.Shared.lib.MConference.validation.csproj
[00:03:41] Compiling /root/rpmbuild/BUILD/openpetra-test/csharp/ICT/Petra/Shared/lib/MFinance/Ict.Petra.Shared.lib.MFinance.csproj
[00:03:42] Compiling /root/rpmbuild/BUILD/openpetra-test/csharp/ICT/Petra/Server/lib/MCommon/Ict.Petra.Server.lib.MCommon.csproj
[00:03:43] /root/rpmbuild/BUILD/openpetra-test/csharp/ICT/Petra/Server/lib/MCommon/Main.cs(701,21) : warning CS0162: Unreachable code detected
[00:03:43] Compiling /root/rpmbuild/BUILD/openpetra-test/csharp/ICT/Petra/Shared/lib/MHospitality/validation/Ict.Petra.Shared.lib.MHospitality.validation.csproj
[00:03:44] Compiling /root/rpmbuild/BUILD/openpetra-test/csharp/ICT/Petra/Shared/lib/MPartner/Ict.Petra.Shared.lib.MPartner.csproj
[00:03:45] Compiling /root/rpmbuild/BUILD/openpetra-test/csharp/ICT/Petra/Server/lib/MSysMan/DBUpgrades/Ict.Petra.Server.lib.MSysMan.DBUpgrades.csproj
[00:03:46] Compiling /root/rpmbuild/BUILD/openpetra-test/csharp/ICT/Petra/Shared/lib/MPartner/conversion/Ict.Petra.Shared.lib.MPartner.conversion.csproj
[00:03:47] /root/rpmbuild/BUILD/openpetra-test/csharp/ICT/Petra/Shared/lib/MPartner/conversion/ContactDetails.cs(1921,20) : warning CS0219: The variable `ATelephoneNumberStrOrig' is assigned but its value is never used
[00:03:47] Compiling /root/rpmbuild/BUILD/openpetra-test/csharp/ICT/Petra/Shared/lib/MPartner/validation/Ict.Petra.Shared.lib.MPartner.validation.csproj
[00:03:49] Compiling /root/rpmbuild/BUILD/openpetra-test/csharp/ICT/Petra/Shared/lib/MFinance/validation/Ict.Petra.Shared.lib.MFinance.validation.csproj
[00:03:50] /root/rpmbuild/BUILD/openpetra-test/csharp/ICT/Petra/Shared/lib/MFinance/validation/GL.Validation.cs(690,13) : warning CS0162: Unreachable code detected
[00:03:50] Compiling /root/rpmbuild/BUILD/openpetra-test/csharp/ICT/Petra/Shared/lib/MPersonnel/Ict.Petra.Shared.lib.MPersonnel.csproj
[00:03:51] Compiling /root/rpmbuild/BUILD/openpetra-test/csharp/ICT/Petra/Shared/lib/MPersonnel/validation/Ict.Petra.Shared.lib.MPersonnel.validation.csproj
[00:03:52] Compiling /root/rpmbuild/BUILD/openpetra-test/csharp/ICT/Petra/Shared/lib/MReporting/Ict.Petra.Shared.lib.MReporting.csproj
[00:03:53] Compiling /root/rpmbuild/BUILD/openpetra-test/csharp/ICT/Petra/Server/lib/MReporting/Ict.Petra.Server.lib.MReporting.csproj
[00:03:54] Compiling /root/rpmbuild/BUILD/openpetra-test/csharp/ICT/Petra/Server/lib/MReporting/core/Ict.Petra.Server.lib.MReporting.core.csproj
[00:03:55] Compiling /root/rpmbuild/BUILD/openpetra-test/csharp/ICT/Petra/Shared/lib/MSysMan/Ict.Petra.Shared.lib.MSysMan.csproj
[00:03:56] Compiling /root/rpmbuild/BUILD/openpetra-test/csharp/ICT/Petra/Server/lib/MFinance/Common/Ict.Petra.Server.lib.MFinance.Common.csproj
[00:03:57] Compiling /root/rpmbuild/BUILD/openpetra-test/csharp/ICT/Petra/Server/lib/MFinance/data/Ict.Petra.Server.lib.MFinance.data.csproj
[00:03:58] Compiling /root/rpmbuild/BUILD/openpetra-test/csharp/ICT/Petra/Server/lib/MPartner/Common/Ict.Petra.Server.lib.MPartner.Common.csproj
[00:03:59] /root/rpmbuild/BUILD/openpetra-test/csharp/ICT/Petra/Server/lib/MPartner/Common/DataAggregates.PPartnerAddress.cs(2094,13) : warning CS0162: Unreachable code detected
[00:03:59] /root/rpmbuild/BUILD/openpetra-test/csharp/ICT/Petra/Server/lib/MPartner/Common/FormLetterTools.cs(124,20) : warning CS0219: The variable `workingText' is assigned but its value is never used
[00:03:59] Compiling /root/rpmbuild/BUILD/openpetra-test/csharp/ICT/Petra/Server/lib/MCommon/queries/Ict.Petra.Server.lib.MCommon.queries.csproj
[00:04:00] Compiling /root/rpmbuild/BUILD/openpetra-test/csharp/ICT/Petra/Server/lib/MFinance/queries/Ict.Petra.Server.lib.MFinance.queries.csproj
[00:04:01] Compiling /root/rpmbuild/BUILD/openpetra-test/csharp/ICT/Petra/Server/lib/MFinance/setup/Ict.Petra.Server.lib.MFinance.setup.csproj
[00:04:03] /root/rpmbuild/BUILD/openpetra-test/csharp/ICT/Petra/Server/lib/MFinance/setup/GL.Setup.cs(3418,34) : warning CS0429: Unreachable expression code detected
[00:04:03] /root/rpmbuild/BUILD/openpetra-test/csharp/ICT/Petra/Server/lib/MFinance/setup/GL.Setup.cs(3420,25) : warning CS0162: Unreachable code detected
[00:04:03] Compiling /root/rpmbuild/BUILD/openpetra-test/csharp/ICT/Petra/Server/app/JsClient/Ict.Petra.Server.app.JsClient.csproj
[00:04:04] /root/rpmbuild/BUILD/openpetra-test/csharp/ICT/Petra/Server/app/JsClient/Navigation.cs(107,58) : warning CS0429: Unreachable expression code detected
[00:04:04] /root/rpmbuild/BUILD/openpetra-test/csharp/ICT/Petra/Server/app/JsClient/Navigation.cs(109,25) : warning CS0162: Unreachable code detected
[00:04:04] /root/rpmbuild/BUILD/openpetra-test/csharp/ICT/Petra/Server/app/JsClient/Navigation.cs(48,29) : warning CS0414: The private field `Ict.Petra.Server.app.JSClient.TUINavigation.FMultiLedgerSite' is assigned but its value is never used
[00:04:04] /root/rpmbuild/BUILD/openpetra-test/csharp/ICT/Petra/Server/app/JsClient/Navigation.cs(50,28) : warning CS0414: The private field `Ict.Petra.Server.app.JSClient.TUINavigation.FCurrentLedger' is assigned but its value is never used
[00:04:04] Compiling /root/rpmbuild/BUILD/openpetra-test/csharp/ICT/Petra/Server/lib/MFinance/GL/Ict.Petra.Server.lib.MFinance.GL.csproj
[00:04:05] /root/rpmbuild/BUILD/openpetra-test/csharp/ICT/Petra/Server/lib/MFinance/GL/GL.Transactions.cs(1678,20) : warning CS0219: The variable `AnalysisAttrList' is assigned but its value is never used
[00:04:05] /root/rpmbuild/BUILD/openpetra-test/csharp/ICT/Petra/Server/lib/MFinance/GL/Reporting.UIConnectors.cs(3158,20) : warning CS0219: The variable `strEndDate' is assigned but its value is never used
[00:04:05] /root/rpmbuild/BUILD/openpetra-test/csharp/ICT/Petra/Server/lib/MFinance/GL/Reporting.UIConnectors.cs(3381,18) : warning CS0219: The variable `TaxDeductiblePercentageEnabled' is assigned but its value is never used
[00:04:05] /root/rpmbuild/BUILD/openpetra-test/csharp/ICT/Petra/Server/lib/MFinance/GL/Reporting.GiftReports.UIConnectors.cs(64,28) : warning CS0219: The variable `CurrentDate' is assigned but its value is never used
[00:04:05] /root/rpmbuild/BUILD/openpetra-test/csharp/ICT/Petra/Server/lib/MFinance/GL/Reporting.GiftReports.UIConnectors.cs(314,28) : warning CS0219: The variable `partnerKeyName' is assigned but its value is never used
[00:04:05] /root/rpmbuild/BUILD/openpetra-test/csharp/ICT/Petra/Server/lib/MFinance/GL/Reporting.UIConnectors.cs(1386,28) : warning CS0219: The variable `is12MothsBeforeEnd' is assigned but its value is never used
[00:04:05] Compiling /root/rpmbuild/BUILD/openpetra-test/csharp/ICT/Petra/Server/lib/MFinance/Budget/Ict.Petra.Server.lib.MFinance.Budget.csproj
[00:04:06] /root/rpmbuild/BUILD/openpetra-test/csharp/ICT/Petra/Server/lib/MFinance/Budget/Budget.Maintain.cs(379,25) : warning CS0219: The variable `MyCultureInfoDate' is assigned but its value is never used
[00:04:06] Compiling /root/rpmbuild/BUILD/openpetra-test/csharp/ICT/Petra/Server/lib/MFinance/Gift/Ict.Petra.Server.lib.MFinance.Gift.csproj
[00:04:08] Compiling /root/rpmbuild/BUILD/openpetra-test/csharp/ICT/Petra/Server/lib/MFinance/BankImport/Ict.Petra.Server.lib.MFinance.BankImport.csproj
[00:04:09] /root/rpmbuild/BUILD/openpetra-test/csharp/ICT/Petra/Server/lib/MFinance/BankImport/Connector.cs(548,29) : warning CS0162: Unreachable code detected
[00:04:09] Compiling /root/rpmbuild/BUILD/openpetra-test/csharp/ICT/Petra/Server/lib/MFinance/connect/Ict.Petra.Server.lib.MFinance.connect.csproj
[00:04:09] Compiling /root/rpmbuild/BUILD/openpetra-test/csharp/ICT/Petra/Server/lib/MPartner/processing/Ict.Petra.Server.lib.MPartner.processing.csproj
[00:04:11] Compiling /root/rpmbuild/BUILD/openpetra-test/csharp/ICT/Petra/Server/lib/MPartner/queries/Ict.Petra.Server.lib.MPartner.queries.csproj
[00:04:11] Compiling /root/rpmbuild/BUILD/openpetra-test/csharp/ICT/Petra/Server/lib/MPersonnel/Ict.Petra.Server.lib.MPersonnel.csproj
[00:04:13] /root/rpmbuild/BUILD/openpetra-test/csharp/ICT/Petra/Server/lib/MPersonnel/Reporting.Personnel.UIConnectors.cs(522,20) : warning CS0219: The variable `date' is assigned but its value is never used
[00:04:13] /root/rpmbuild/BUILD/openpetra-test/csharp/ICT/Petra/Server/lib/MPersonnel/Reporting.Personnel.UIConnectors.cs(582,23) : warning CS0219: The variable `PreviousExperience' is assigned but its value is never used
[00:04:13] /root/rpmbuild/BUILD/openpetra-test/csharp/ICT/Petra/Server/lib/MPersonnel/Reporting.Personnel.UIConnectors.cs(667,23) : warning CS0219: The variable `PreviousExperience' is assigned but its value is never used
[00:04:13] Compiling /root/rpmbuild/BUILD/openpetra-test/csharp/ICT/Petra/Server/lib/MPersonnel/queries/Ict.Petra.Server.lib.MPersonnel.queries.csproj
[00:04:14] Compiling /root/rpmbuild/BUILD/openpetra-test/csharp/ICT/Petra/Server/lib/MReporting/MFinance/Ict.Petra.Server.lib.MReporting.MFinance.csproj
[00:04:15] Compiling /root/rpmbuild/BUILD/openpetra-test/csharp/ICT/Petra/Server/lib/MReporting/connect/Ict.Petra.Server.lib.MReporting.connect.csproj
[00:04:16] Compiling /root/rpmbuild/BUILD/openpetra-test/csharp/ICT/Petra/Shared/lib/MSysMan/validation/Ict.Petra.Shared.lib.MSysMan.validation.csproj
[00:04:17] Compiling /root/rpmbuild/BUILD/openpetra-test/csharp/ICT/Petra/Server/lib/MPartner/data/Ict.Petra.Server.lib.MPartner.data.csproj
[00:04:18] Compiling /root/rpmbuild/BUILD/openpetra-test/csharp/ICT/Petra/Server/lib/MPersonnel/web/Ict.Petra.Server.lib.MPersonnel.web.csproj
[00:04:19] Compiling /root/rpmbuild/BUILD/openpetra-test/csharp/ICT/Petra/Server/lib/MPartner/connect/Ict.Petra.Server.lib.MPartner.connect.csproj
[00:04:20] Compiling /root/rpmbuild/BUILD/openpetra-test/csharp/ICT/Petra/Server/lib/MPartner/web/Ict.Petra.Server.lib.MPartner.web.csproj
[00:04:22] /root/rpmbuild/BUILD/openpetra-test/csharp/ICT/Petra/Server/lib/MPartner/web/ImportExportCSV.cs(768,28) : warning CS0219: The variable `fmt' is assigned but its value is never used
[00:04:22] /root/rpmbuild/BUILD/openpetra-test/csharp/ICT/Petra/Server/lib/MPartner/web/ImportExportTax.cs(93,18) : warning CS0219: The variable `createOutputFile' is assigned but its value is never used
[00:04:22] /root/rpmbuild/BUILD/openpetra-test/csharp/ICT/Petra/Server/lib/MPartner/web/Reporting.Partner.UIConnectors.cs(184,23) : warning CS0219: The variable `PartnerSelectionTable' is assigned but its value is never used
[00:04:22] Compiling /root/rpmbuild/BUILD/openpetra-test/csharp/ICT/Petra/Server/lib/MConference/Ict.Petra.Server.lib.MConference.csproj
[00:04:23] Compiling /root/rpmbuild/BUILD/openpetra-test/csharp/ICT/Petra/Server/lib/MConference/web/Ict.Petra.Server.lib.MConference.web.csproj
[00:04:24] Compiling /root/rpmbuild/BUILD/openpetra-test/csharp/ICT/Petra/Server/lib/MFinance/AP/Ict.Petra.Server.lib.MFinance.AP.csproj
[00:04:25] Compiling /root/rpmbuild/BUILD/openpetra-test/csharp/ICT/Petra/Server/lib/MReporting/MPartner/Ict.Petra.Server.lib.MReporting.MPartner.csproj
[00:04:26] Compiling /root/rpmbuild/BUILD/openpetra-test/csharp/ICT/Petra/Server/lib/MReporting/MFinDev/Ict.Petra.Server.lib.MReporting.MFinDev.csproj
[00:04:26] Compiling /root/rpmbuild/BUILD/openpetra-test/csharp/ICT/Petra/Server/lib/MReporting/MPersonnel/Ict.Petra.Server.lib.MReporting.MPersonnel.csproj
[00:04:27] Compiling /root/rpmbuild/BUILD/openpetra-test/csharp/ICT/Petra/Server/lib/MSysMan/Ict.Petra.Server.lib.MSysMan.csproj
[00:04:28] /root/rpmbuild/BUILD/openpetra-test/csharp/ICT/Petra/Server/lib/MSysMan/UserManagement.cs(1095,17) : warning CS0162: Unreachable code detected
[00:04:28] Compiling /root/rpmbuild/BUILD/openpetra-test/csharp/ICT/Petra/Server/lib/MCommon/processing/Ict.Petra.Server.lib.MCommon.processing.csproj
[00:04:29] Compiling /root/rpmbuild/BUILD/openpetra-test/csharp/ICT/Petra/Server/lib/MFinance/ICH/Ict.Petra.Server.lib.MFinance.ICH.csproj
[00:04:30] Compiling /root/rpmbuild/BUILD/openpetra-test/csharp/ICT/Petra/Server/app/Delegates/Ict.Petra.Server.app.Delegates.csproj
[00:04:31] Compiling /root/rpmbuild/BUILD/openpetra-test/csharp/ICT/Petra/Server/lib/MSysMan/web/Ict.Petra.Server.lib.MSysMan.web.csproj
[00:04:32] Compiling /root/rpmbuild/BUILD/openpetra-test/csharp/ICT/Petra/Server/app/WebService/Ict.Petra.Server.app.WebService.csproj
[00:04:33] Compiling /root/rpmbuild/BUILD/openpetra-test/csharp/ICT/Petra/ServerAdmin/PetraServerAdminConsole/PetraServerAdminConsole.csproj
[00:04:34]      [echo] Target quickCompile finished at: 02/02/2019 22:43:46
[00:04:34] 
[00:04:34] quickCompile:
[00:04:34] 
[00:04:34]      [echo] Target quickCompile started at: 02/02/2019 22:43:46
[00:04:34] compiling OpenPetra.YmlGzImportExport
[00:04:34] Compiling /root/rpmbuild/BUILD/openpetra-test/csharp/ICT/Petra/Tools/YmlGzImportExport/Ict.Petra.Tools.MSysMan.YmlGzImportExport.csproj
[00:04:35]      [echo] Target quickCompile finished at: 02/02/2019 22:43:47
[00:04:35] 
[00:04:35] init:
[00:04:35] 
[00:04:35] 
[00:04:35] createSQLStatements:
[00:04:35] 
[00:04:35] [ExecDotNet] Reading xml file /root/rpmbuild/BUILD/openpetra-test/db/petra.xml...
[00:04:36] [ExecDotNet] Writing file to /root/rpmbuild/BUILD/openpetra-test/delivery/db/petra.sql...
[00:04:36] [ExecDotNet] Success: file written: /root/rpmbuild/BUILD/openpetra-test/delivery/db/petra.sql
[00:04:36] [ExecDotNet] Success: file written: /root/rpmbuild/BUILD/openpetra-test/delivery/db/petra_withoutConstraints.sql
[00:04:36] [ExecDotNet] Success: file written: /root/rpmbuild/BUILD/openpetra-test/delivery/db/petra_remove.sql
[00:04:36] [ExecDotNet] Success: file written: /root/rpmbuild/BUILD/openpetra-test/delivery/db/petra_clean.sql
[00:04:36] [ExecDotNet] Success: file written: /root/rpmbuild/BUILD/openpetra-test/delivery/db/loaddata.sh
[00:04:36] [ExecDotNet] Success: file written: /root/rpmbuild/BUILD/openpetra-test/delivery/db/createtables-MySQL.sql
[00:04:36] [ExecDotNet] Success: file written: /root/rpmbuild/BUILD/openpetra-test/delivery/db/createconstraints-MySQL.sql
[00:04:36] 
[00:04:36] translation:
[00:04:36] 
[00:04:36]      [echo] Target translation started at: 02/02/2019 22:43:48
[00:04:36]      [nant] /root/rpmbuild/BUILD/openpetra-test/i18n/i18n.build compile
[00:04:36]             Buildfile: file:///root/rpmbuild/BUILD/openpetra-test/i18n/i18n.build
[00:04:36]             Target framework: Mono 4.0 Profile
[00:04:36]             Target(s) specified: compile 
[00:04:36]             
[00:04:38]             
[00:04:38]             downloadTranslations:
[00:04:38]             
[00:04:38]             
[00:04:38]             translation:
[00:04:38]             
[00:04:38]                 [mkdir] Creating directory '/root/rpmbuild/BUILD/openpetra-test/tmp/i18n'.
[00:04:44]             
[00:04:44]             compile:
[00:04:44]             
[00:04:44]             
[00:04:44]             BUILD SUCCEEDED
[00:04:44]             
[00:04:44]             Total time: 8.2 seconds.
[00:04:44]             
[00:04:44]      [echo] Target translation finished at: 02/02/2019 22:43:56
[00:04:44] 
[00:04:44] prepareSetupDirForTarFile:
[00:04:44] 
[00:04:44]     [mkdir] Creating directory '/root/rpmbuild/BUILD/openpetra-test/delivery/bin/tmp/openpetraorg-2019.02.0.2'.
[00:04:44]     [mkdir] Creating directory '/root/rpmbuild/BUILD/openpetra-test/delivery/bin/tmp/openpetraorg-2019.02.0.2/db'.
[00:04:44]     [mkdir] Creating directory '/root/rpmbuild/BUILD/openpetra-test/delivery/bin/tmp/openpetraorg-2019.02.0.2/etc'.
[00:04:44]     [mkdir] Creating directory '/root/rpmbuild/BUILD/openpetra-test/delivery/bin/tmp/openpetraorg-2019.02.0.2/reports'.
[00:04:44]     [mkdir] Creating directory '/root/rpmbuild/BUILD/openpetra-test/delivery/bin/tmp/openpetraorg-2019.02.0.2/manuals'.
[00:04:44]     [mkdir] Creating directory '/root/rpmbuild/BUILD/openpetra-test/delivery/bin/tmp/openpetraorg-2019.02.0.2/sql'.
[00:04:44]     [mkdir] Creating directory '/root/rpmbuild/BUILD/openpetra-test/delivery/bin/tmp/openpetraorg-2019.02.0.2/emails'.
[00:04:44]     [mkdir] Creating directory '/root/rpmbuild/BUILD/openpetra-test/delivery/bin/tmp/openpetraorg-2019.02.0.2/formletters'.
[00:04:44]     [mkdir] Creating directory '/root/rpmbuild/BUILD/openpetra-test/delivery/bin/tmp/openpetraorg-2019.02.0.2/bin'.
[00:04:44]     [mkdir] Creating directory '/root/rpmbuild/BUILD/openpetra-test/delivery/bin/tmp/openpetraorg-2019.02.0.2/server'.
[00:04:44]     [mkdir] Creating directory '/root/rpmbuild/BUILD/openpetra-test/delivery/bin/tmp/openpetraorg-2019.02.0.2/client'.
[00:04:44]      [copy] Copying 96 files to '/root/rpmbuild/BUILD/openpetra-test/delivery/bin/tmp/openpetraorg-2019.02.0.2/bin'.
[00:04:44]      [copy] Copying 1 file to '/root/rpmbuild/BUILD/openpetra-test/delivery/bin/tmp/openpetraorg-2019.02.0.2/bin'.
[00:04:44]      [copy] Copying 2 files to '/root/rpmbuild/BUILD/openpetra-test/delivery/bin/tmp/openpetraorg-2019.02.0.2/manuals'.
[00:04:44]      [copy] Copying 236 files to '/root/rpmbuild/BUILD/openpetra-test/delivery/bin/tmp/openpetraorg-2019.02.0.2/reports'.
[00:04:44]      [copy] Copying 1 file to '/root/rpmbuild/BUILD/openpetra-test/delivery/bin/tmp/openpetraorg-2019.02.0.2/LICENSE'.
[00:04:44]      [copy] Copying 11 files to '/root/rpmbuild/BUILD/openpetra-test/delivery/bin/tmp/openpetraorg-2019.02.0.2/server'.
[00:04:44]      [copy] Copying 1 file to '/root/rpmbuild/BUILD/openpetra-test/delivery/bin/tmp/openpetraorg-2019.02.0.2/server/Default.aspx'.
[00:04:44]      [copy] Copying 1 file to '/root/rpmbuild/BUILD/openpetra-test/delivery/bin/tmp/openpetraorg-2019.02.0.2/openpetra-server.sh'.
[00:04:44]      [copy] Copying 1 file to '/root/rpmbuild/BUILD/openpetra-test/delivery/bin/tmp/openpetraorg-2019.02.0.2/etc/web-sample.config'.
[00:04:44]      [copy] Copying 3 files to '/root/rpmbuild/BUILD/openpetra-test/delivery/bin/tmp/openpetraorg-2019.02.0.2/etc'.
[00:04:44]      [copy] Copying 6 files to '/root/rpmbuild/BUILD/openpetra-test/delivery/bin/tmp/openpetraorg-2019.02.0.2/formletters'.
[00:04:44]      [copy] Copying 1 file to '/root/rpmbuild/BUILD/openpetra-test/delivery/bin/tmp/openpetraorg-2019.02.0.2/db/createtables-MySQL.sql'.
[00:04:44]      [copy] Copying 1 file to '/root/rpmbuild/BUILD/openpetra-test/delivery/bin/tmp/openpetraorg-2019.02.0.2/db/createconstraints-MySQL.sql'.
[00:04:44]      [copy] Copying 1 file to '/root/rpmbuild/BUILD/openpetra-test/delivery/bin/tmp/openpetraorg-2019.02.0.2/db/createdb-MySQL.sql'.
[00:04:44]      [copy] Copying 1 file to '/root/rpmbuild/BUILD/openpetra-test/delivery/bin/tmp/openpetraorg-2019.02.0.2/INSTALL'.
[00:04:44]      [copy] Copying 45 files to '/root/rpmbuild/BUILD/openpetra-test/delivery/bin/tmp/openpetraorg-2019.02.0.2/sql'.
[00:04:44]      [copy] Copying 5 files to '/root/rpmbuild/BUILD/openpetra-test/delivery/bin/tmp/openpetraorg-2019.02.0.2/sql'.
[00:04:44]      [copy] Copying 4 files to '/root/rpmbuild/BUILD/openpetra-test/delivery/bin/tmp/openpetraorg-2019.02.0.2/emails'.
[00:04:44] 
[00:04:44] BUILD SUCCEEDED
[00:04:44] 
[00:04:44] Total time: 174.2 seconds.
[00:04:44] 
[00:04:45] + sed -i 's~<title>OpenPetra</title>~<title>OpenPetra by SolidCharity</title>~g' ../openpetra-client/index.html
[00:04:45] + sed -i s~CURRENTRELEASE~2019.02.0.2~g ../openpetra-client/src/lib/navigation.js
[00:04:45] + sed -i s~CURRENTRELEASE~2019.02.0.2~g ../openpetra-client/src/lib/i18n.js
[00:04:45] + sed -i s~CURRENTRELEASE~2019.02.0.2~g ../openpetra-client/index.html
[00:04:45] + sed -i 's/develop = 1;/develop = 0;/g' ../openpetra-client/src/lib/navigation.js
[00:04:45] + sed -i 's/debug = 1;/debug = 0;/g' ../openpetra-client/src/lib/navigation.js
[00:04:45] + sed -i 's/develop = 1;/develop = 0;/g' ../openpetra-client/src/lib/i18n.js
[00:04:45] + sed -i 's/develop = 1;/develop = 0;/g' ../openpetra-client/index.html
[00:04:45] + exit 0
[00:04:45] Executing(%install): /bin/sh -e /var/tmp/rpm-tmp.R1Q1Nw
[00:04:45] + umask 022
[00:04:45] + cd /root/rpmbuild/BUILD
[00:04:45] + '[' /root/rpmbuild/BUILDROOT/openpetranow-mysql-test-2019.02.0-2.x86_64 '!=' / ']'
[00:04:45] + rm -rf /root/rpmbuild/BUILDROOT/openpetranow-mysql-test-2019.02.0-2.x86_64
[00:04:45] ++ dirname /root/rpmbuild/BUILDROOT/openpetranow-mysql-test-2019.02.0-2.x86_64
[00:04:45] + mkdir -p /root/rpmbuild/BUILDROOT
[00:04:45] + mkdir /root/rpmbuild/BUILDROOT/openpetranow-mysql-test-2019.02.0-2.x86_64
[00:04:45] + cd openpetra-test
[00:04:45] + rm -rf /root/rpmbuild/BUILDROOT/openpetranow-mysql-test-2019.02.0-2.x86_64
[00:04:45] + mkdir -p /root/rpmbuild/BUILDROOT/openpetranow-mysql-test-2019.02.0-2.x86_64//usr/local/openpetra
[00:04:45] ++ pwd
[00:04:45] + cp -R /root/rpmbuild/BUILD/openpetra-test/delivery/bin/tmp/openpetraorg-2019.02.0.2/INSTALL /root/rpmbuild/BUILD/openpetra-test/delivery/bin/tmp/openpetraorg-2019.02.0.2/LICENSE /root/rpmbuild/BUILD/openpetra-test/delivery/bin/tmp/openpetraorg-2019.02.0.2/bin /root/rpmbuild/BUILD/openpetra-test/delivery/bin/tmp/openpetraorg-2019.02.0.2/client /root/rpmbuild/BUILD/openpetra-test/delivery/bin/tmp/openpetraorg-2019.02.0.2/db /root/rpmbuild/BUILD/openpetra-test/delivery/bin/tmp/openpetraorg-2019.02.0.2/emails /root/rpmbuild/BUILD/openpetra-test/delivery/bin/tmp/openpetraorg-2019.02.0.2/etc /root/rpmbuild/BUILD/openpetra-test/delivery/bin/tmp/openpetraorg-2019.02.0.2/formletters /root/rpmbuild/BUILD/openpetra-test/delivery/bin/tmp/openpetraorg-2019.02.0.2/manuals /root/rpmbuild/BUILD/openpetra-test/delivery/bin/tmp/openpetraorg-2019.02.0.2/openpetra-server.sh /root/rpmbuild/BUILD/openpetra-test/delivery/bin/tmp/openpetraorg-2019.02.0.2/reports /root/rpmbuild/BUILD/openpetra-test/delivery/bin/tmp/openpetraorg-2019.02.0.2/server /root/rpmbuild/BUILD/openpetra-test/delivery/bin/tmp/openpetraorg-2019.02.0.2/sql /root/rpmbuild/BUILDROOT/openpetranow-mysql-test-2019.02.0-2.x86_64//usr/local/openpetra
[00:04:45] + cd /root/rpmbuild/BUILDROOT/openpetranow-mysql-test-2019.02.0-2.x86_64//usr/local/openpetra/server
[00:04:45] + ln -s ../bin bin
[00:04:45] + cd -
[00:04:45] /root/rpmbuild/BUILD/openpetra-test
[00:04:45] + cd /root/rpmbuild/BUILDROOT/openpetranow-mysql-test-2019.02.0-2.x86_64//usr/local/openpetra/server
[00:04:45] + ln -s . api
[00:04:45] + cd -
[00:04:45] /root/rpmbuild/BUILD/openpetra-test
[00:04:45] + cd ../openpetra-client
[00:04:45] + npm install
[00:04:48] audited 1034 packages in 2.835s
[00:04:48] found 0 vulnerabilities
[00:04:48] 
[00:04:48] + npm run build
[00:04:48] 
[00:04:48] > openpetra-client-js@2018.2.0 build /root/rpmbuild/BUILD/openpetra-client
[00:04:48] > npm run build-debug && npm run build-min
[00:04:48] 
[00:04:49] 
[00:04:49] > openpetra-client-js@2018.2.0 build-debug /root/rpmbuild/BUILD/openpetra-client
[00:04:49] > mkdir -p dist && mkdir -p fonts && cp -f node_modules/font-awesome/css/font-awesome.min.css dist && cp -f node_modules/font-awesome/fonts/* fonts && browserify -t browserify-css src/index.js -d > dist/bundle.js
[00:04:49] 
[00:04:50] 
[00:04:50] > openpetra-client-js@2018.2.0 build-min /root/rpmbuild/BUILD/openpetra-client
[00:04:50] > mkdir -p dist && mkdir -p fonts && cp -f node_modules/font-awesome/css/font-awesome.min.css dist && cp -f node_modules/font-awesome/fonts/* fonts && browserify -t browserify-css src/index.js | uglifyjs -c > dist/bundle.min.js
[00:04:50] 
[00:04:56] + cp node_modules/bootstrap/dist/css/bootstrap.min.css css
[00:04:56] + rm -Rf node_modules
[00:04:56] + cd -
[00:04:56] /root/rpmbuild/BUILD/openpetra-test
[00:04:56] + cp -R ../openpetra-client/Readme.md ../openpetra-client/css ../openpetra-client/cypress ../openpetra-client/cypress.json ../openpetra-client/dist ../openpetra-client/etc ../openpetra-client/fonts ../openpetra-client/img ../openpetra-client/index.html ../openpetra-client/locales ../openpetra-client/package-lock.json ../openpetra-client/package.json ../openpetra-client/src /root/rpmbuild/BUILDROOT/openpetranow-mysql-test-2019.02.0-2.x86_64//usr/local/openpetra/client
[00:04:56] + mkdir -p /root/rpmbuild/BUILDROOT/openpetranow-mysql-test-2019.02.0-2.x86_64/usr/bin
[00:04:56] + chmod a+x /root/rpmbuild/BUILDROOT/openpetranow-mysql-test-2019.02.0-2.x86_64//usr/local/openpetra/openpetra-server.sh
[00:04:56] + dos2unix /root/rpmbuild/BUILDROOT/openpetranow-mysql-test-2019.02.0-2.x86_64//usr/local/openpetra/openpetra-server.sh
[00:04:56] dos2unix: converting file /root/rpmbuild/BUILDROOT/openpetranow-mysql-test-2019.02.0-2.x86_64//usr/local/openpetra/openpetra-server.sh to Unix format ...
[00:04:56] + cd /root/rpmbuild/BUILDROOT/openpetranow-mysql-test-2019.02.0-2.x86_64/usr/bin
[00:04:56] + ln -s ../..//usr/local/openpetra/openpetra-server.sh openpetra-server
[00:04:56] + cd -
[00:04:56] /root/rpmbuild/BUILD/openpetra-test
[00:04:56] + cd /root/rpmbuild/BUILDROOT/openpetranow-mysql-test-2019.02.0-2.x86_64//usr/local/openpetra/bin
[00:04:56] + mv ../etc/web-sample.config web.config
[00:04:56] + cd -
[00:04:56] /root/rpmbuild/BUILD/openpetra-test
[00:04:56] + cp /root/rpmbuild/SOURCES/base.yml.gz /root/rpmbuild/BUILDROOT/openpetranow-mysql-test-2019.02.0-2.x86_64//usr/local/openpetra/db
[00:04:56] + cp /root/rpmbuild/SOURCES/clean.yml.gz /root/rpmbuild/BUILDROOT/openpetranow-mysql-test-2019.02.0-2.x86_64//usr/local/openpetra/db
[00:04:56] + mkdir -p /root/rpmbuild/BUILDROOT/openpetranow-mysql-test-2019.02.0-2.x86_64/usr/lib/systemd/system
[00:04:56] ++ pwd
[00:04:56] + cp /root/rpmbuild/BUILD/openpetra-test/setup/petra0300/linuxserver/mysql/centos/openpetra-server.service /root/rpmbuild/BUILDROOT/openpetranow-mysql-test-2019.02.0-2.x86_64/usr/lib/systemd/system/openpetra.service
[00:04:56] + rm -f /root/rpmbuild/BUILDROOT/openpetranow-mysql-test-2019.02.0-2.x86_64//usr/local/openpetra/bin/libsodium-64.dll /root/rpmbuild/BUILDROOT/openpetranow-mysql-test-2019.02.0-2.x86_64//usr/local/openpetra/bin/libsodium.dll
[00:04:56] + ln -s /usr/lib64/libsodium.so.23 /root/rpmbuild/BUILDROOT/openpetranow-mysql-test-2019.02.0-2.x86_64//usr/local/openpetra/bin/libsodium.so
[00:04:56] + /usr/lib/rpm/check-buildroot
[00:04:56] + /usr/lib/rpm/redhat/brp-compress
[00:04:56] + /usr/lib/rpm/redhat/brp-strip /usr/bin/strip
[00:04:56] + /usr/lib/rpm/redhat/brp-strip-comment-note /usr/bin/strip /usr/bin/objdump
[00:04:56] + /usr/lib/rpm/redhat/brp-strip-static-archive /usr/bin/strip
[00:04:56] + /usr/lib/rpm/brp-python-bytecompile /usr/bin/python 1
[00:04:56] + /usr/lib/rpm/redhat/brp-python-hardlink
[00:04:56] + /usr/lib/rpm/redhat/brp-java-repack-jars
[00:04:56] Processing files: openpetranow-mysql-test-2019.02.0-2.x86_64
[00:04:57] Provides: openpetranow-mysql-test = 2019.02.0-2 openpetranow-mysql-test(x86-64) = 2019.02.0-2
[00:04:57] Requires(rpmlib): rpmlib(FileDigests) <= 4.6.0-1 rpmlib(PayloadFilesHavePrefix) <= 4.0-1 rpmlib(CompressedFileNames) <= 3.0.4-1
[00:04:57] Checking for unpackaged file(s): /usr/lib/rpm/check-files /root/rpmbuild/BUILDROOT/openpetranow-mysql-test-2019.02.0-2.x86_64
[00:04:57] Wrote: /root/rpmbuild/SRPMS/openpetranow-mysql-test-2019.02.0-2.src.rpm
[00:05:01] Wrote: /root/rpmbuild/RPMS/x86_64/openpetranow-mysql-test-2019.02.0-2.x86_64.rpm
[00:05:01] Executing(%clean): /bin/sh -e /var/tmp/rpm-tmp.1YhPHI
[00:05:01] + umask 022
[00:05:01] + cd /root/rpmbuild/BUILD
[00:05:01] + cd openpetra-test
[00:05:01] + '[' -d /root/rpmbuild/BUILDROOT/openpetranow-mysql-test-2019.02.0-2.x86_64 ']'
[00:05:01] + '[' / '!=' /root/rpmbuild/BUILDROOT/openpetranow-mysql-test-2019.02.0-2.x86_64 ']'
[00:05:01] + rm -rf /root/rpmbuild/BUILDROOT/openpetranow-mysql-test-2019.02.0-2.x86_64
[00:05:01] + exit 0
[00:05:01] 0
[00:05:01] now running: ssh -f -o "StrictHostKeyChecking no" -o Port=22 -i /etc/lightbuildserver/container/container_rsa root@10.0.3.5 "export LC_ALL=C; (gpg --import < ~/.ssh/privateLBSkey; cp -f ~/.ssh/rpmmacros ~/.rpmmacros) 2>&1 && echo \$?"
[00:05:01] gpg: directory `/root/.gnupg' created
[00:05:01] gpg: new configuration file `/root/.gnupg/gpg.conf' created
[00:05:01] gpg: WARNING: options in `/root/.gnupg/gpg.conf' are not yet active during this run
[00:05:01] gpg: keyring `/root/.gnupg/secring.gpg' created
[00:05:01] gpg: keyring `/root/.gnupg/pubring.gpg' created
[00:05:01] gpg: key 919684AC: secret key imported
[00:05:01] gpg: /root/.gnupg/trustdb.gpg: trustdb created
[00:05:01] gpg: key 919684AC: public key "Timotheus Pokorra (LBS auto signing) <release@solidcharity.com>" imported
[00:05:01] gpg: Total number processed: 1
[00:05:01] gpg:               imported: 1  (RSA: 1)
[00:05:01] gpg:       secret keys read: 1
[00:05:01] gpg:   secret keys imported: 1
[00:05:01] 0
[00:05:01] now running: ssh -f -o "StrictHostKeyChecking no" -o Port=22 -i /etc/lightbuildserver/container/container_rsa root@10.0.3.5 "export LC_ALL=C; (if ls rpmbuild/RPMS/x86_64/*.rpm 1> /dev/null 2>&1; then rpm --addsign rpmbuild/RPMS/x86_64/*.rpm; fi) 2>&1 && echo \$?"
[00:05:01] Enter pass phrase: Pass phrase is good.
[00:05:01] rpmbuild/RPMS/x86_64/openpetranow-mysql-test-2019.02.0-2.x86_64.rpm:
[00:05:01] 0
[00:05:01] now running: ssh -f -o "StrictHostKeyChecking no" -o Port=22 -i /etc/lightbuildserver/container/container_rsa root@10.0.3.5 "export LC_ALL=C; (if ls rpmbuild/RPMS/noarch/*.rpm 1> /dev/null 2>&1; then rpm --addsign rpmbuild/RPMS/noarch/*.rpm; fi) 2>&1 && echo \$?"
[00:05:01] 0
[00:05:01] now running: ssh -f -o "StrictHostKeyChecking no" -o Port=22 -i /etc/lightbuildserver/container/container_rsa root@10.0.3.5 "export LC_ALL=C; (mkdir -p ~/repo/src) 2>&1 && echo \$?"
[00:05:01] 0
[00:05:01] now running: ssh -f -o "StrictHostKeyChecking no" -o Port=22 -i /etc/lightbuildserver/container/container_rsa root@10.0.3.5 "export LC_ALL=C; (cp ~/rpmbuild/SRPMS/*.src.rpm ~/repo/src) 2>&1 && echo \$?"
[00:05:01] 0
[00:05:01] now running: ssh -f -o "StrictHostKeyChecking no" -o Port=22 -i /etc/lightbuildserver/container/container_rsa root@10.0.3.5 "export LC_ALL=C; (cp -R ~/rpmbuild/RPMS/* ~/repo) 2>&1 && echo \$?"
[00:05:02] 0
[00:05:02] now running: ssh -f -o "StrictHostKeyChecking no" -o Port=22 -i /etc/lightbuildserver/container/container_rsa root@10.0.3.5 "export LC_ALL=C; (cd repo && createrepo .) 2>&1 && echo \$?"
[00:05:07] Spawning worker 0 with 51 pkgs
[00:05:07] Spawning worker 1 with 51 pkgs
[00:05:07] Workers Finished
[00:05:07] Saving Primary metadata
[00:05:07] Saving file lists metadata
[00:05:07] Saving other metadata
[00:05:07] Generating sqlite DBs
[00:05:07] Sqlite DBs complete
[00:05:07] 0
[00:05:07] now running: rsync -avz --delete -e "ssh -i /etc/lightbuildserver/container/container_rsa -p 2222" root@build04lxc.lbs.solidcharity.com:/mnt/var/lib/lightbuildserver/repos/solidcharity/openpetra/centos/7 /var/lib/lightbuildserver/repos/solidcharity/openpetra/centos
[00:05:07] receiving incremental file list
[00:05:07] 7/
[00:05:07] deleting 7/repodata/f763a4b12519b30d77c4dda0fda2aaa2a1b96b930a397d24d0e29f9a329994e5-primary.sqlite.bz2
[00:05:07] deleting 7/repodata/a403744bd1c46e21d239eb8a6155f633e6a3aebb47e6c83fa830418c9b644477-other.sqlite.bz2
[00:05:07] deleting 7/repodata/a03484e4a44e237d179548c23a6763c77e77485268dbc299fee43f1bebfdf397-primary.xml.gz
[00:05:07] deleting 7/repodata/94ce794e958eb463b17785ff5348a46b11f9c6cc24da9baeacd5b82ddc5ddf6f-filelists.sqlite.bz2
[00:05:07] deleting 7/repodata/6b42cfb4e3a4144565f5b281889a09c3808948bd9f2427bf31560f5a529ce80c-other.xml.gz
[00:05:07] deleting 7/repodata/43bc16d512342041543bddb13910af2b2aec95b85ebba98d8ab9feb54d10cc1e-filelists.xml.gz
[00:05:07] 7/repodata/
[00:05:07] 7/repodata/12d317d4b519cdf2bd4afc69bb9ca77a062474f955cd77acd6ebb0b78e2daeac-other.xml.gz
[00:05:07] 7/repodata/3307e958058675aa52cf7630c038f2f6d5353db02b5a3dc875b77916e9a42e47-primary.sqlite.bz2
[00:05:07] 7/repodata/391151572a4549dfd4c49606756c37e76279725ff7e8ce1a9b56c66746380dbb-filelists.sqlite.bz2
[00:05:07] 7/repodata/7639a5ba982999c8ce4abc4d9efe2b815ffc43a95698fa2875d3de0d4a430325-other.sqlite.bz2
[00:05:07] 7/repodata/a0f050bb2db80e083aae0345b1aa645ea4e7aa1e1bfc085ec5094186a00d5f91-filelists.xml.gz
[00:05:07] 7/repodata/dc5a28a458c127bf2c80889090ca4a1efd37f04bf82fb70f0dfcd5c9d7baf048-primary.xml.gz
[00:05:07] 7/repodata/repomd.xml
[00:05:07] 7/src/
[00:05:07] 7/src/openpetranow-mysql-test-2019.02.0-2.src.rpm
[00:05:08] 7/x86_64/
[00:05:08] 7/x86_64/openpetranow-mysql-test-2019.02.0-2.x86_64.rpm
[00:05:08] 
[00:05:08] sent 253 bytes  received 25,175,420 bytes  16,783,782.00 bytes/sec
[00:05:08] total size is 1,070,814,129  speedup is 42.53
[00:05:08] now running: rsync -avz --delete -e "ssh -i /etc/lightbuildserver/container/container_rsa -p 2222" root@build04lxc.lbs.solidcharity.com:/mnt/var/lib/lightbuildserver/tarballs/solidcharity/openpetra /var/lib/lightbuildserver/tarballs/solidcharity
[00:05:08] receiving incremental file list
[00:05:08] 
[00:05:08] sent 25 bytes  received 617 bytes  428.00 bytes/sec
[00:05:08] total size is 571,479,859  speedup is 890,155.54
[00:05:08] Success!
[00:05:20] This build took about 5 minutes

	
go to top of this page