Build Result for tbits.net/TBitsKolab16Dev/kolab/TBitsKolab16Dev

go to bottom of this page
[00:00:00]  * Starting at 2019-03-08 21:14:45 GMT+0100
[00:00:00]  * Preparing the machine...
[00:00:01] now running: ssh -f -o "StrictHostKeyChecking no" -p 2222 -i /etc/lightbuildserver/container/container_rsa root@build04lxc.lbs.solidcharity.com "export LC_ALL=C; (if [ -d /var/lib/lxc/005-build04lxc.lbs.solidcharity.com ]; then lxc-destroy --name 005-build04lxc.lbs.solidcharity.com; fi) 2>&1; echo \$?"
[00:00:03] lxc-destroy: 005-build04lxc.lbs.solidcharity.com: tools/lxc_destroy.c: main: 271 Destroyed container 005-build04lxc.lbs.solidcharity.com
[00:00:03] 0
[00:00:03] now running: ssh -f -o "StrictHostKeyChecking no" -p 2222 -i /etc/lightbuildserver/container/container_rsa root@build04lxc.lbs.solidcharity.com "export LC_ALL=C; (/usr/share/lxc-scripts/initLXC.sh) 2>&1; echo \$?"
[00:00:03] patching file lxc-fedora
[00:00:03] Hunk #1 FAILED at 562.
[00:00:03] Hunk #2 FAILED at 570.
[00:00:03] Hunk #3 FAILED at 647.
[00:00:03] Hunk #4 FAILED at 680.
[00:00:03] Hunk #5 FAILED at 813.
[00:00:03] Hunk #6 succeeded at 3626 (offset 2435 lines).
[00:00:03] 5 out of 6 hunks FAILED -- saving rejects to file lxc-fedora.rej
[00:00:03] patching file lxc-fedora
[00:00:03] Hunk #1 FAILED at 687.
[00:00:03] Hunk #2 FAILED at 695.
[00:00:03] Hunk #3 FAILED at 809.
[00:00:03] Hunk #4 FAILED at 1016.
[00:00:03] 4 out of 4 hunks FAILED -- saving rejects to file lxc-fedora.rej
[00:00:04] 0
[00:00:04] now running: ssh -f -o "StrictHostKeyChecking no" -p 2222 -i /etc/lightbuildserver/container/container_rsa root@build04lxc.lbs.solidcharity.com "export LC_ALL=C; (/usr/share/lxc-scripts/initCentOS.sh 005-build04lxc.lbs.solidcharity.com 5 7 amd64 0) 2>&1; echo \$?"
[00:00:04] Using image from local cache
[00:00:04] Unpacking the rootfs
[00:00:11] 
[00:00:11] ---
[00:00:11] You just created a Centos 7 x86_64 (20190302_07:08) container.
[00:00:11] Host 10.0.3.5 not found in /root/.ssh/known_hosts
[00:00:11] /root
[00:00:16] Loaded plugins: fastestmirror
[00:00:16] Loading mirror speeds from cached hostfile
[00:00:17]  * base: centosmirror.netcup.net
[00:00:17]  * extras: mirror.imt-systems.com
[00:00:17]  * updates: mirror.ratiokontakt.de
[00:00:17] Resolving Dependencies
[00:00:17] --> Running transaction check
[00:00:17] ---> Package openssh-server.x86_64 0:7.4p1-16.el7 will be installed
[00:00:17] --> Processing Dependency: libwrap.so.0()(64bit) for package: openssh-server-7.4p1-16.el7.x86_64
[00:00:17] --> Running transaction check
[00:00:17] ---> Package tcp_wrappers-libs.x86_64 0:7.6-77.el7 will be installed
[00:00:18] --> Finished Dependency Resolution
[00:00:18] 
[00:00:18] Dependencies Resolved
[00:00:18] 
[00:00:18] ================================================================================
[00:00:18]  Package                  Arch          Version               Repository   Size
[00:00:18] ================================================================================
[00:00:18] Installing:
[00:00:18]  openssh-server           x86_64        7.4p1-16.el7          base        458 k
[00:00:18] Installing for dependencies:
[00:00:18]  tcp_wrappers-libs        x86_64        7.6-77.el7            base         66 k
[00:00:18] 
[00:00:18] Transaction Summary
[00:00:18] ================================================================================
[00:00:18] Install  1 Package (+1 Dependent package)
[00:00:18] 
[00:00:18] Total size: 525 k
[00:00:18] Installed size: 1.1 M
[00:00:18] Downloading packages:
[00:00:18] Running transaction check
[00:00:18] Running transaction test
[00:00:18] Transaction test succeeded
[00:00:18] Running transaction
[00:00:18]   Installing : tcp_wrappers-libs-7.6-77.el7.x86_64                          1/2 
[00:00:18]   Installing : openssh-server-7.4p1-16.el7.x86_64                           2/2 
[00:00:18]   Verifying  : tcp_wrappers-libs-7.6-77.el7.x86_64                          1/2 
[00:00:18]   Verifying  : openssh-server-7.4p1-16.el7.x86_64                           2/2 
[00:00:18] 
[00:00:18] Installed:
[00:00:18]   openssh-server.x86_64 0:7.4p1-16.el7                                          
[00:00:18] 
[00:00:18] Dependency Installed:
[00:00:18]   tcp_wrappers-libs.x86_64 0:7.6-77.el7                                         
[00:00:18] 
[00:00:18] Complete!
[00:00:21] Removing password for user root.
[00:00:21] passwd: Success
[00:00:21] To setup port forwarding from outside, please run:
[00:00:21] ./tunnelport.sh 5 22
[00:00:21] ./initWebproxy.sh 5 www.005-build04lxc.lbs.solidcharity.com.de
[00:00:21] 
[00:00:21] To start the container, run: lxc-start -d -n 005-build04lxc.lbs.solidcharity.com
[00:00:21] 
[00:00:21] To connect to the container locally, run: eval `ssh-agent`; ssh-add; ssh root@10.0.3.5
[00:00:21] 0
[00:00:21] now running: ssh -f -o "StrictHostKeyChecking no" -p 2222 -i /etc/lightbuildserver/container/container_rsa root@build04lxc.lbs.solidcharity.com "export LC_ALL=C; (/usr/share/lxc-scripts/tunnelport.sh 5 22) 2>&1; echo \$?"
[00:00:21] outward interface: ens18
[00:00:21] outward IP address: 80.241.214.124
[00:00:21] bridge interface: lxcbr0
[00:00:21] bridge address: 10.0.3.1
[00:00:21] guestip: 10.0.3.5
[00:00:21] there is already a mapping for port  2005
[00:00:21] 0
[00:00:21] now running: ssh -f -o "StrictHostKeyChecking no" -p 2222 -i /etc/lightbuildserver/container/container_rsa root@build04lxc.lbs.solidcharity.com "export LC_ALL=C; (mkdir -p /var/lib/lxc/005-build04lxc.lbs.solidcharity.com/rootfs/root/.ssh/) 2>&1; echo \$?"
[00:00:22] 0
[00:00:22] now running: echo "put /etc/lightbuildserver/container/container_rsa.pub authorized_keys2" | sftp -o "StrictHostKeyChecking no" -oPort=2222 -i /etc/lightbuildserver/container/container_rsa root@build04lxc.lbs.solidcharity.com:/var/lib/lxc/005-build04lxc.lbs.solidcharity.com/rootfs/root/.ssh/
[00:00:22] Connected to build04lxc.lbs.solidcharity.com.
[00:00:22] Changing to: /var/lib/lxc/005-build04lxc.lbs.solidcharity.com/rootfs/root/.ssh/
[00:00:22] sftp> put /etc/lightbuildserver/container/container_rsa.pub authorized_keys2
[00:00:22] Uploading /etc/lightbuildserver/container/container_rsa.pub to /var/lib/lxc/005-build04lxc.lbs.solidcharity.com/rootfs/root/.ssh/authorized_keys2
[00:00:22] now running: ssh -f -o "StrictHostKeyChecking no" -p 2222 -i /etc/lightbuildserver/container/container_rsa root@build04lxc.lbs.solidcharity.com "export LC_ALL=C; (cd /var/lib/lxc/005-build04lxc.lbs.solidcharity.com/rootfs/root/.ssh/ && cat authorized_keys2 >> authorized_keys && rm authorized_keys2) 2>&1; echo \$?"
[00:00:22] 0
[00:00:22] now running: ssh -f -o "StrictHostKeyChecking no" -p 2222 -i /etc/lightbuildserver/container/container_rsa root@build04lxc.lbs.solidcharity.com "export LC_ALL=C; (chmod 700 /var/lib/lxc/005-build04lxc.lbs.solidcharity.com/rootfs/root/.ssh/ && chmod 600 /var/lib/lxc/005-build04lxc.lbs.solidcharity.com/rootfs/root/.ssh/authorized_keys) 2>&1; echo \$?"
[00:00:23] 0
[00:00:23] now running: ssh -f -o "StrictHostKeyChecking no" -p 2222 -i /etc/lightbuildserver/container/container_rsa root@build04lxc.lbs.solidcharity.com "export LC_ALL=C; (/usr/share/lxc-scripts/initMount.sh /mnt/var/lib/lightbuildserver/repos/tbits.net/TBitsKolab16Dev/centos/7 005-build04lxc.lbs.solidcharity.com /root/repo) 2>&1; echo \$?"
[00:00:23] 0
[00:00:23] now running: rsync -avz --delete -e "ssh -i /etc/lightbuildserver/container/container_rsa -p 2222" /var/lib/lightbuildserver/repos/tbits.net/TBitsKolab16Dev/centos/7 root@build04lxc.lbs.solidcharity.com:/mnt/var/lib/lightbuildserver/repos/tbits.net/TBitsKolab16Dev/centos
[00:00:23] sending incremental file list
[00:00:23] 7/lbs-tbits.net-TBitsKolab16Dev.repo
[00:00:23] 7/repodata/
[00:00:23] 
[00:00:23] sent 4,759 bytes  received 101 bytes  3,240.00 bytes/sec
[00:00:23] total size is 45,112,541  speedup is 9,282.42
[00:00:23] now running: ssh -f -o "StrictHostKeyChecking no" -p 2222 -i /etc/lightbuildserver/container/container_rsa root@build04lxc.lbs.solidcharity.com "export LC_ALL=C; (/usr/share/lxc-scripts/initMount.sh /mnt/var/lib/lightbuildserver/tarballs/tbits.net/TBitsKolab16Dev 005-build04lxc.lbs.solidcharity.com /root/tarball) 2>&1; echo \$?"
[00:00:24] 0
[00:00:24] now running: rsync -avz --delete -e "ssh -i /etc/lightbuildserver/container/container_rsa -p 2222" /var/lib/lightbuildserver/tarballs/tbits.net/TBitsKolab16Dev root@build04lxc.lbs.solidcharity.com:/mnt/var/lib/lightbuildserver/tarballs/tbits.net
[00:00:24] sending incremental file list
[00:00:24] 
[00:00:24] sent 80 bytes  received 17 bytes  194.00 bytes/sec
[00:00:24] total size is 0  speedup is 0.00
[00:00:24] now running: ssh -f -o "StrictHostKeyChecking no" -p 2222 -i /etc/lightbuildserver/container/container_rsa root@build04lxc.lbs.solidcharity.com "export LC_ALL=C; (lxc-start -d -n 005-build04lxc.lbs.solidcharity.com) 2>&1; echo \$?"
[00:00:24] 0
[00:00:24] now running: ssh-keygen -f "/run/uwsgi/.ssh/known_hosts" -R 10.0.3.5
[00:00:24] # Host 10.0.3.5 found: line 7
[00:00:24] /run/uwsgi/.ssh/known_hosts updated.
[00:00:24] Original contents retained as /run/uwsgi/.ssh/known_hosts.old
[00:00:24] now running: ssh -f -o "StrictHostKeyChecking no" -o Port=22 -i /etc/lightbuildserver/container/container_rsa root@10.0.3.5 "export LC_ALL=C; (echo "container is running") 2>&1 && echo \$?"
[00:00:25] ssh: connect to host 10.0.3.5 port 22: Connection refused
[00:00:25] now running: ssh -f -o "StrictHostKeyChecking no" -o Port=22 -i /etc/lightbuildserver/container/container_rsa root@10.0.3.5 "export LC_ALL=C; (echo "container is running") 2>&1 && echo \$?"
[00:00:25] ssh: connect to host 10.0.3.5 port 22: Connection refused
[00:00:26] now running: ssh -f -o "StrictHostKeyChecking no" -o Port=22 -i /etc/lightbuildserver/container/container_rsa root@10.0.3.5 "export LC_ALL=C; (echo "container is running") 2>&1 && echo \$?"
[00:00:26] Warning: Permanently added '10.0.3.5' (ECDSA) to the list of known hosts.
[00:00:26] container is running
[00:00:26] 0
[00:00:26] container has been started successfully
[00:00:26] now running: ssh -f -o "StrictHostKeyChecking no" -o Port=22 -i /etc/lightbuildserver/container/container_rsa root@10.0.3.5 "export LC_ALL=C; (yum -y install tar createrepo gcc rpm-build rpm-sign gnupg make curl iptables rsync perl iproute yum-utils yum-plugin-priorities) 2>&1 && echo \$?"
[00:00:26] Loaded plugins: fastestmirror
[00:00:26] Loading mirror speeds from cached hostfile
[00:00:26]  * base: centosmirror.netcup.net
[00:00:26]  * extras: mirror.imt-systems.com
[00:00:26]  * updates: mirror.ratiokontakt.de
[00:00:26] Package 2:tar-1.26-35.el7.x86_64 already installed and latest version
[00:00:27] Package gnupg2-2.0.22-5.el7_5.x86_64 already installed and latest version
[00:00:27] Package curl-7.29.0-51.el7.x86_64 already installed and latest version
[00:00:27] Package iptables-1.4.21-28.el7.x86_64 already installed and latest version
[00:00:27] Package iproute-4.11.0-14.el7.x86_64 already installed and latest version
[00:00:27] Resolving Dependencies
[00:00:27] --> Running transaction check
[00:00:27] ---> Package createrepo.noarch 0:0.9.9-28.el7 will be installed
[00:00:27] --> Processing Dependency: python-deltarpm for package: createrepo-0.9.9-28.el7.noarch
[00:00:27] --> Processing Dependency: libxml2-python for package: createrepo-0.9.9-28.el7.noarch
[00:00:27] --> Processing Dependency: deltarpm for package: createrepo-0.9.9-28.el7.noarch
[00:00:27] ---> Package gcc.x86_64 0:4.8.5-36.el7 will be installed
[00:00:27] --> Processing Dependency: libgomp = 4.8.5-36.el7 for package: gcc-4.8.5-36.el7.x86_64
[00:00:27] --> Processing Dependency: cpp = 4.8.5-36.el7 for package: gcc-4.8.5-36.el7.x86_64
[00:00:27] --> Processing Dependency: glibc-devel >= 2.2.90-12 for package: gcc-4.8.5-36.el7.x86_64
[00:00:27] --> Processing Dependency: libmpfr.so.4()(64bit) for package: gcc-4.8.5-36.el7.x86_64
[00:00:27] --> Processing Dependency: libmpc.so.3()(64bit) for package: gcc-4.8.5-36.el7.x86_64
[00:00:27] --> Processing Dependency: libgomp.so.1()(64bit) for package: gcc-4.8.5-36.el7.x86_64
[00:00:27] ---> Package make.x86_64 1:3.82-23.el7 will be installed
[00:00:27] ---> Package perl.x86_64 4:5.16.3-294.el7_6 will be installed
[00:00:27] --> Processing Dependency: perl-libs = 4:5.16.3-294.el7_6 for package: 4:perl-5.16.3-294.el7_6.x86_64
[00:00:27] --> Processing Dependency: perl(Socket) >= 1.3 for package: 4:perl-5.16.3-294.el7_6.x86_64
[00:00:27] --> Processing Dependency: perl(Scalar::Util) >= 1.10 for package: 4:perl-5.16.3-294.el7_6.x86_64
[00:00:27] --> Processing Dependency: perl-macros for package: 4:perl-5.16.3-294.el7_6.x86_64
[00:00:27] --> Processing Dependency: perl-libs for package: 4:perl-5.16.3-294.el7_6.x86_64
[00:00:27] --> Processing Dependency: perl(threads::shared) for package: 4:perl-5.16.3-294.el7_6.x86_64
[00:00:27] --> Processing Dependency: perl(threads) for package: 4:perl-5.16.3-294.el7_6.x86_64
[00:00:27] --> Processing Dependency: perl(constant) for package: 4:perl-5.16.3-294.el7_6.x86_64
[00:00:27] --> Processing Dependency: perl(Time::Local) for package: 4:perl-5.16.3-294.el7_6.x86_64
[00:00:27] --> Processing Dependency: perl(Time::HiRes) for package: 4:perl-5.16.3-294.el7_6.x86_64
[00:00:27] --> Processing Dependency: perl(Storable) for package: 4:perl-5.16.3-294.el7_6.x86_64
[00:00:27] --> Processing Dependency: perl(Socket) for package: 4:perl-5.16.3-294.el7_6.x86_64
[00:00:27] --> Processing Dependency: perl(Scalar::Util) for package: 4:perl-5.16.3-294.el7_6.x86_64
[00:00:27] --> Processing Dependency: perl(Pod::Simple::XHTML) for package: 4:perl-5.16.3-294.el7_6.x86_64
[00:00:27] --> Processing Dependency: perl(Pod::Simple::Search) for package: 4:perl-5.16.3-294.el7_6.x86_64
[00:00:27] --> Processing Dependency: perl(Getopt::Long) for package: 4:perl-5.16.3-294.el7_6.x86_64
[00:00:27] --> Processing Dependency: perl(Filter::Util::Call) for package: 4:perl-5.16.3-294.el7_6.x86_64
[00:00:27] --> Processing Dependency: perl(File::Temp) for package: 4:perl-5.16.3-294.el7_6.x86_64
[00:00:27] --> Processing Dependency: perl(File::Spec::Unix) for package: 4:perl-5.16.3-294.el7_6.x86_64
[00:00:27] --> Processing Dependency: perl(File::Spec::Functions) for package: 4:perl-5.16.3-294.el7_6.x86_64
[00:00:27] --> Processing Dependency: perl(File::Spec) for package: 4:perl-5.16.3-294.el7_6.x86_64
[00:00:27] --> Processing Dependency: perl(File::Path) for package: 4:perl-5.16.3-294.el7_6.x86_64
[00:00:27] --> Processing Dependency: perl(Exporter) for package: 4:perl-5.16.3-294.el7_6.x86_64
[00:00:27] --> Processing Dependency: perl(Cwd) for package: 4:perl-5.16.3-294.el7_6.x86_64
[00:00:27] --> Processing Dependency: perl(Carp) for package: 4:perl-5.16.3-294.el7_6.x86_64
[00:00:27] --> Processing Dependency: libperl.so()(64bit) for package: 4:perl-5.16.3-294.el7_6.x86_64
[00:00:27] ---> Package rpm-build.x86_64 0:4.11.3-35.el7 will be installed
[00:00:27] --> Processing Dependency: patch >= 2.5 for package: rpm-build-4.11.3-35.el7.x86_64
[00:00:27] --> Processing Dependency: elfutils >= 0.128 for package: rpm-build-4.11.3-35.el7.x86_64
[00:00:27] --> Processing Dependency: unzip for package: rpm-build-4.11.3-35.el7.x86_64
[00:00:27] --> Processing Dependency: system-rpm-config for package: rpm-build-4.11.3-35.el7.x86_64
[00:00:27] --> Processing Dependency: perl(Thread::Queue) for package: rpm-build-4.11.3-35.el7.x86_64
[00:00:27] --> Processing Dependency: file for package: rpm-build-4.11.3-35.el7.x86_64
[00:00:27] --> Processing Dependency: bzip2 for package: rpm-build-4.11.3-35.el7.x86_64
[00:00:27] --> Processing Dependency: /usr/bin/gdb-add-index for package: rpm-build-4.11.3-35.el7.x86_64
[00:00:27] ---> Package rpm-sign.x86_64 0:4.11.3-35.el7 will be installed
[00:00:27] ---> Package rsync.x86_64 0:3.1.2-4.el7 will be installed
[00:00:27] ---> Package yum-plugin-priorities.noarch 0:1.1.31-50.el7 will be installed
[00:00:27] ---> Package yum-utils.noarch 0:1.1.31-50.el7 will be installed
[00:00:27] --> Processing Dependency: python-kitchen for package: yum-utils-1.1.31-50.el7.noarch
[00:00:27] --> Running transaction check
[00:00:27] ---> Package bzip2.x86_64 0:1.0.6-13.el7 will be installed
[00:00:27] ---> Package cpp.x86_64 0:4.8.5-36.el7 will be installed
[00:00:27] ---> Package deltarpm.x86_64 0:3.6-3.el7 will be installed
[00:00:27] ---> Package elfutils.x86_64 0:0.172-2.el7 will be installed
[00:00:27] ---> Package file.x86_64 0:5.11-35.el7 will be installed
[00:00:27] ---> Package gdb.x86_64 0:7.6.1-114.el7 will be installed
[00:00:27] ---> Package glibc-devel.x86_64 0:2.17-260.el7_6.3 will be installed
[00:00:27] --> Processing Dependency: glibc-headers = 2.17-260.el7_6.3 for package: glibc-devel-2.17-260.el7_6.3.x86_64
[00:00:27] --> Processing Dependency: glibc-headers for package: glibc-devel-2.17-260.el7_6.3.x86_64
[00:00:27] ---> Package libgomp.x86_64 0:4.8.5-36.el7 will be installed
[00:00:27] ---> Package libmpc.x86_64 0:1.0.1-3.el7 will be installed
[00:00:27] ---> Package libxml2-python.x86_64 0:2.9.1-6.el7_2.3 will be installed
[00:00:27] ---> Package mpfr.x86_64 0:3.1.1-4.el7 will be installed
[00:00:27] ---> Package patch.x86_64 0:2.7.1-10.el7_5 will be installed
[00:00:27] ---> Package perl-Carp.noarch 0:1.26-244.el7 will be installed
[00:00:27] ---> Package perl-Exporter.noarch 0:5.68-3.el7 will be installed
[00:00:27] ---> Package perl-File-Path.noarch 0:2.09-2.el7 will be installed
[00:00:27] ---> Package perl-File-Temp.noarch 0:0.23.01-3.el7 will be installed
[00:00:27] ---> Package perl-Filter.x86_64 0:1.49-3.el7 will be installed
[00:00:27] ---> Package perl-Getopt-Long.noarch 0:2.40-3.el7 will be installed
[00:00:27] --> Processing Dependency: perl(Pod::Usage) >= 1.14 for package: perl-Getopt-Long-2.40-3.el7.noarch
[00:00:27] --> Processing Dependency: perl(Text::ParseWords) for package: perl-Getopt-Long-2.40-3.el7.noarch
[00:00:27] ---> Package perl-PathTools.x86_64 0:3.40-5.el7 will be installed
[00:00:27] ---> Package perl-Pod-Simple.noarch 1:3.28-4.el7 will be installed
[00:00:27] --> Processing Dependency: perl(Pod::Escapes) >= 1.04 for package: 1:perl-Pod-Simple-3.28-4.el7.noarch
[00:00:27] --> Processing Dependency: perl(Encode) for package: 1:perl-Pod-Simple-3.28-4.el7.noarch
[00:00:27] ---> Package perl-Scalar-List-Utils.x86_64 0:1.27-248.el7 will be installed
[00:00:27] ---> Package perl-Socket.x86_64 0:2.010-4.el7 will be installed
[00:00:27] ---> Package perl-Storable.x86_64 0:2.45-3.el7 will be installed
[00:00:27] ---> Package perl-Thread-Queue.noarch 0:3.02-2.el7 will be installed
[00:00:27] ---> Package perl-Time-HiRes.x86_64 4:1.9725-3.el7 will be installed
[00:00:27] ---> Package perl-Time-Local.noarch 0:1.2300-2.el7 will be installed
[00:00:27] ---> Package perl-constant.noarch 0:1.27-2.el7 will be installed
[00:00:27] ---> Package perl-libs.x86_64 4:5.16.3-294.el7_6 will be installed
[00:00:27] ---> Package perl-macros.x86_64 4:5.16.3-294.el7_6 will be installed
[00:00:27] ---> Package perl-threads.x86_64 0:1.87-4.el7 will be installed
[00:00:27] ---> Package perl-threads-shared.x86_64 0:1.43-6.el7 will be installed
[00:00:27] ---> Package python-deltarpm.x86_64 0:3.6-3.el7 will be installed
[00:00:27] ---> Package python-kitchen.noarch 0:1.1.1-5.el7 will be installed
[00:00:27] --> Processing Dependency: python-chardet for package: python-kitchen-1.1.1-5.el7.noarch
[00:00:27] ---> Package redhat-rpm-config.noarch 0:9.1.0-87.el7.centos will be installed
[00:00:27] --> Processing Dependency: dwz >= 0.4 for package: redhat-rpm-config-9.1.0-87.el7.centos.noarch
[00:00:27] --> Processing Dependency: zip for package: redhat-rpm-config-9.1.0-87.el7.centos.noarch
[00:00:27] --> Processing Dependency: perl-srpm-macros for package: redhat-rpm-config-9.1.0-87.el7.centos.noarch
[00:00:27] ---> Package unzip.x86_64 0:6.0-19.el7 will be installed
[00:00:27] --> Running transaction check
[00:00:27] ---> Package dwz.x86_64 0:0.11-3.el7 will be installed
[00:00:27] ---> Package glibc-headers.x86_64 0:2.17-260.el7_6.3 will be installed
[00:00:27] --> Processing Dependency: kernel-headers >= 2.2.1 for package: glibc-headers-2.17-260.el7_6.3.x86_64
[00:00:27] --> Processing Dependency: kernel-headers for package: glibc-headers-2.17-260.el7_6.3.x86_64
[00:00:27] ---> Package perl-Encode.x86_64 0:2.51-7.el7 will be installed
[00:00:27] ---> Package perl-Pod-Escapes.noarch 1:1.04-294.el7_6 will be installed
[00:00:27] ---> Package perl-Pod-Usage.noarch 0:1.63-3.el7 will be installed
[00:00:27] --> Processing Dependency: perl(Pod::Text) >= 3.15 for package: perl-Pod-Usage-1.63-3.el7.noarch
[00:00:27] --> Processing Dependency: perl-Pod-Perldoc for package: perl-Pod-Usage-1.63-3.el7.noarch
[00:00:27] ---> Package perl-Text-ParseWords.noarch 0:3.29-4.el7 will be installed
[00:00:27] ---> Package perl-srpm-macros.noarch 0:1-8.el7 will be installed
[00:00:27] ---> Package python-chardet.noarch 0:2.2.1-1.el7_1 will be installed
[00:00:27] ---> Package zip.x86_64 0:3.0-11.el7 will be installed
[00:00:27] --> Running transaction check
[00:00:27] ---> Package kernel-headers.x86_64 0:3.10.0-957.5.1.el7 will be installed
[00:00:27] ---> Package perl-Pod-Perldoc.noarch 0:3.20-4.el7 will be installed
[00:00:27] --> Processing Dependency: perl(parent) for package: perl-Pod-Perldoc-3.20-4.el7.noarch
[00:00:27] --> Processing Dependency: perl(HTTP::Tiny) for package: perl-Pod-Perldoc-3.20-4.el7.noarch
[00:00:27] --> Processing Dependency: groff-base for package: perl-Pod-Perldoc-3.20-4.el7.noarch
[00:00:27] ---> Package perl-podlators.noarch 0:2.5.1-3.el7 will be installed
[00:00:27] --> Running transaction check
[00:00:27] ---> Package groff-base.x86_64 0:1.22.2-8.el7 will be installed
[00:00:27] ---> Package perl-HTTP-Tiny.noarch 0:0.033-3.el7 will be installed
[00:00:27] ---> Package perl-parent.noarch 1:0.225-244.el7 will be installed
[00:00:27] --> Finished Dependency Resolution
[00:00:27] 
[00:00:27] Dependencies Resolved
[00:00:27] 
[00:00:27] ================================================================================
[00:00:27]  Package                   Arch      Version                   Repository  Size
[00:00:27] ================================================================================
[00:00:27] Installing:
[00:00:27]  createrepo                noarch    0.9.9-28.el7              base        94 k
[00:00:27]  gcc                       x86_64    4.8.5-36.el7              base        16 M
[00:00:27]  make                      x86_64    1:3.82-23.el7             base       420 k
[00:00:27]  perl                      x86_64    4:5.16.3-294.el7_6        updates    8.0 M
[00:00:27]  rpm-build                 x86_64    4.11.3-35.el7             base       147 k
[00:00:27]  rpm-sign                  x86_64    4.11.3-35.el7             base        48 k
[00:00:27]  rsync                     x86_64    3.1.2-4.el7               base       403 k
[00:00:27]  yum-plugin-priorities     noarch    1.1.31-50.el7             base        29 k
[00:00:27]  yum-utils                 noarch    1.1.31-50.el7             base       121 k
[00:00:27] Installing for dependencies:
[00:00:27]  bzip2                     x86_64    1.0.6-13.el7              base        52 k
[00:00:27]  cpp                       x86_64    4.8.5-36.el7              base       5.9 M
[00:00:27]  deltarpm                  x86_64    3.6-3.el7                 base        82 k
[00:00:27]  dwz                       x86_64    0.11-3.el7                base        99 k
[00:00:27]  elfutils                  x86_64    0.172-2.el7               base       299 k
[00:00:27]  file                      x86_64    5.11-35.el7               base        57 k
[00:00:27]  gdb                       x86_64    7.6.1-114.el7             base       2.4 M
[00:00:27]  glibc-devel               x86_64    2.17-260.el7_6.3          updates    1.1 M
[00:00:27]  glibc-headers             x86_64    2.17-260.el7_6.3          updates    683 k
[00:00:27]  groff-base                x86_64    1.22.2-8.el7              base       942 k
[00:00:27]  kernel-headers            x86_64    3.10.0-957.5.1.el7        updates    8.0 M
[00:00:27]  libgomp                   x86_64    4.8.5-36.el7              base       157 k
[00:00:27]  libmpc                    x86_64    1.0.1-3.el7               base        51 k
[00:00:27]  libxml2-python            x86_64    2.9.1-6.el7_2.3           base       247 k
[00:00:27]  mpfr                      x86_64    3.1.1-4.el7               base       203 k
[00:00:27]  patch                     x86_64    2.7.1-10.el7_5            base       110 k
[00:00:27]  perl-Carp                 noarch    1.26-244.el7              base        19 k
[00:00:27]  perl-Encode               x86_64    2.51-7.el7                base       1.5 M
[00:00:27]  perl-Exporter             noarch    5.68-3.el7                base        28 k
[00:00:27]  perl-File-Path            noarch    2.09-2.el7                base        26 k
[00:00:27]  perl-File-Temp            noarch    0.23.01-3.el7             base        56 k
[00:00:27]  perl-Filter               x86_64    1.49-3.el7                base        76 k
[00:00:27]  perl-Getopt-Long          noarch    2.40-3.el7                base        56 k
[00:00:27]  perl-HTTP-Tiny            noarch    0.033-3.el7               base        38 k
[00:00:27]  perl-PathTools            x86_64    3.40-5.el7                base        82 k
[00:00:27]  perl-Pod-Escapes          noarch    1:1.04-294.el7_6          updates     51 k
[00:00:27]  perl-Pod-Perldoc          noarch    3.20-4.el7                base        87 k
[00:00:27]  perl-Pod-Simple           noarch    1:3.28-4.el7              base       216 k
[00:00:27]  perl-Pod-Usage            noarch    1.63-3.el7                base        27 k
[00:00:27]  perl-Scalar-List-Utils    x86_64    1.27-248.el7              base        36 k
[00:00:27]  perl-Socket               x86_64    2.010-4.el7               base        49 k
[00:00:27]  perl-Storable             x86_64    2.45-3.el7                base        77 k
[00:00:27]  perl-Text-ParseWords      noarch    3.29-4.el7                base        14 k
[00:00:27]  perl-Thread-Queue         noarch    3.02-2.el7                base        17 k
[00:00:27]  perl-Time-HiRes           x86_64    4:1.9725-3.el7            base        45 k
[00:00:27]  perl-Time-Local           noarch    1.2300-2.el7              base        24 k
[00:00:27]  perl-constant             noarch    1.27-2.el7                base        19 k
[00:00:27]  perl-libs                 x86_64    4:5.16.3-294.el7_6        updates    688 k
[00:00:27]  perl-macros               x86_64    4:5.16.3-294.el7_6        updates     44 k
[00:00:27]  perl-parent               noarch    1:0.225-244.el7           base        12 k
[00:00:27]  perl-podlators            noarch    2.5.1-3.el7               base       112 k
[00:00:27]  perl-srpm-macros          noarch    1-8.el7                   base       4.6 k
[00:00:27]  perl-threads              x86_64    1.87-4.el7                base        49 k
[00:00:27]  perl-threads-shared       x86_64    1.43-6.el7                base        39 k
[00:00:27]  python-chardet            noarch    2.2.1-1.el7_1             base       227 k
[00:00:27]  python-deltarpm           x86_64    3.6-3.el7                 base        31 k
[00:00:27]  python-kitchen            noarch    1.1.1-5.el7               base       267 k
[00:00:27]  redhat-rpm-config         noarch    9.1.0-87.el7.centos       base        81 k
[00:00:27]  unzip                     x86_64    6.0-19.el7                base       170 k
[00:00:27]  zip                       x86_64    3.0-11.el7                base       260 k
[00:00:27] 
[00:00:27] Transaction Summary
[00:00:27] ================================================================================
[00:00:27] Install  9 Packages (+50 Dependent packages)
[00:00:27] 
[00:00:27] Total size: 50 M
[00:00:27] Installed size: 116 M
[00:00:27] Downloading packages:
[00:00:28] Running transaction check
[00:00:28] Running transaction test
[00:00:28] Transaction test succeeded
[00:00:28] Running transaction
[00:00:28]   Installing : mpfr-3.1.1-4.el7.x86_64                                     1/59 
[00:00:28]   Installing : libmpc-1.0.1-3.el7.x86_64                                   2/59 
[00:00:28]   Installing : deltarpm-3.6-3.el7.x86_64                                   3/59 
[00:00:28]   Installing : libxml2-python-2.9.1-6.el7_2.3.x86_64                       4/59 
[00:00:29]   Installing : python-deltarpm-3.6-3.el7.x86_64                            5/59 
[00:00:29]   Installing : cpp-4.8.5-36.el7.x86_64                                     6/59 
[00:00:29]   Installing : elfutils-0.172-2.el7.x86_64                                 7/59 
[00:00:29]   Installing : patch-2.7.1-10.el7_5.x86_64                                 8/59 
[00:00:29]   Installing : python-chardet-2.2.1-1.el7_1.noarch                         9/59 
[00:00:29]   Installing : python-kitchen-1.1.1-5.el7.noarch                          10/59 
[00:00:29]   Installing : zip-3.0-11.el7.x86_64                                      11/59 
[00:00:29]   Installing : libgomp-4.8.5-36.el7.x86_64                                12/59 
[00:00:29]   Installing : file-5.11-35.el7.x86_64                                    13/59 
[00:00:29]   Installing : perl-srpm-macros-1-8.el7.noarch                            14/59 
[00:00:29]   Installing : gdb-7.6.1-114.el7.x86_64                                   15/59 
[00:00:30]   Installing : dwz-0.11-3.el7.x86_64                                      16/59 
[00:00:30]   Installing : groff-base-1.22.2-8.el7.x86_64                             17/59 
[00:00:30]   Installing : 1:perl-parent-0.225-244.el7.noarch                         18/59 
[00:00:30]   Installing : perl-HTTP-Tiny-0.033-3.el7.noarch                          19/59 
[00:00:30]   Installing : perl-podlators-2.5.1-3.el7.noarch                          20/59 
[00:00:30]   Installing : perl-Pod-Perldoc-3.20-4.el7.noarch                         21/59 
[00:00:30]   Installing : 1:perl-Pod-Escapes-1.04-294.el7_6.noarch                   22/59 
[00:00:30]   Installing : perl-Text-ParseWords-3.29-4.el7.noarch                     23/59 
[00:00:30]   Installing : perl-Encode-2.51-7.el7.x86_64                              24/59 
[00:00:30]   Installing : perl-Pod-Usage-1.63-3.el7.noarch                           25/59 
[00:00:30]   Installing : perl-threads-1.87-4.el7.x86_64                             26/59 
[00:00:30]   Installing : 4:perl-Time-HiRes-1.9725-3.el7.x86_64                      27/59 
[00:00:30]   Installing : perl-Exporter-5.68-3.el7.noarch                            28/59 
[00:00:30]   Installing : perl-constant-1.27-2.el7.noarch                            29/59 
[00:00:30]   Installing : perl-Carp-1.26-244.el7.noarch                              30/59 
[00:00:30]   Installing : 4:perl-libs-5.16.3-294.el7_6.x86_64                        31/59 
[00:00:30]   Installing : perl-Time-Local-1.2300-2.el7.noarch                        32/59 
[00:00:30]   Installing : 4:perl-macros-5.16.3-294.el7_6.x86_64                      33/59 
[00:00:30]   Installing : perl-Socket-2.010-4.el7.x86_64                             34/59 
[00:00:30]   Installing : perl-Storable-2.45-3.el7.x86_64                            35/59 
[00:00:30]   Installing : perl-threads-shared-1.43-6.el7.x86_64                      36/59 
[00:00:30]   Installing : perl-PathTools-3.40-5.el7.x86_64                           37/59 
[00:00:30]   Installing : perl-Scalar-List-Utils-1.27-248.el7.x86_64                 38/59 
[00:00:30]   Installing : 1:perl-Pod-Simple-3.28-4.el7.noarch                        39/59 
[00:00:30]   Installing : perl-File-Temp-0.23.01-3.el7.noarch                        40/59 
[00:00:30]   Installing : perl-File-Path-2.09-2.el7.noarch                           41/59 
[00:00:30]   Installing : perl-Filter-1.49-3.el7.x86_64                              42/59 
[00:00:31]   Installing : perl-Getopt-Long-2.40-3.el7.noarch                         43/59 
[00:00:31]   Installing : 4:perl-5.16.3-294.el7_6.x86_64                             44/59 
[00:00:31]   Installing : perl-Thread-Queue-3.02-2.el7.noarch                        45/59 
[00:00:31]   Installing : redhat-rpm-config-9.1.0-87.el7.centos.noarch               46/59 
[00:00:32]   Installing : bzip2-1.0.6-13.el7.x86_64                                  47/59 
[00:00:32]   Installing : unzip-6.0-19.el7.x86_64                                    48/59 
[00:00:32]   Installing : kernel-headers-3.10.0-957.5.1.el7.x86_64                   49/59 
[00:00:32]   Installing : glibc-headers-2.17-260.el7_6.3.x86_64                      50/59 
[00:00:34]   Installing : glibc-devel-2.17-260.el7_6.3.x86_64                        51/59 
[00:00:34]   Installing : gcc-4.8.5-36.el7.x86_64                                    52/59 
[00:00:34]   Installing : rpm-build-4.11.3-35.el7.x86_64                             53/59 
[00:00:34]   Installing : yum-utils-1.1.31-50.el7.noarch                             54/59 
[00:00:34]   Installing : createrepo-0.9.9-28.el7.noarch                             55/59 
[00:00:34]   Installing : rsync-3.1.2-4.el7.x86_64                                   56/59 
[00:00:34]   Installing : 1:make-3.82-23.el7.x86_64                                  57/59 
[00:00:34]   Installing : rpm-sign-4.11.3-35.el7.x86_64                              58/59 
[00:00:34]   Installing : yum-plugin-priorities-1.1.31-50.el7.noarch                 59/59 
[00:00:34]   Verifying  : perl-HTTP-Tiny-0.033-3.el7.noarch                           1/59 
[00:00:34]   Verifying  : kernel-headers-3.10.0-957.5.1.el7.x86_64                    2/59 
[00:00:34]   Verifying  : rpm-build-4.11.3-35.el7.x86_64                              3/59 
[00:00:34]   Verifying  : perl-threads-shared-1.43-6.el7.x86_64                       4/59 
[00:00:34]   Verifying  : 4:perl-Time-HiRes-1.9725-3.el7.x86_64                       5/59 
[00:00:34]   Verifying  : 1:perl-Pod-Escapes-1.04-294.el7_6.noarch                    6/59 
[00:00:34]   Verifying  : perl-threads-1.87-4.el7.x86_64                              7/59 
[00:00:34]   Verifying  : perl-Exporter-5.68-3.el7.noarch                             8/59 
[00:00:34]   Verifying  : perl-constant-1.27-2.el7.noarch                             9/59 
[00:00:34]   Verifying  : perl-PathTools-3.40-5.el7.x86_64                           10/59 
[00:00:34]   Verifying  : perl-Pod-Perldoc-3.20-4.el7.noarch                         11/59 
[00:00:34]   Verifying  : perl-Carp-1.26-244.el7.noarch                              12/59 
[00:00:34]   Verifying  : unzip-6.0-19.el7.x86_64                                    13/59 
[00:00:34]   Verifying  : 1:perl-parent-0.225-244.el7.noarch                         14/59 
[00:00:34]   Verifying  : bzip2-1.0.6-13.el7.x86_64                                  15/59 
[00:00:34]   Verifying  : gcc-4.8.5-36.el7.x86_64                                    16/59 
[00:00:34]   Verifying  : yum-plugin-priorities-1.1.31-50.el7.noarch                 17/59 
[00:00:34]   Verifying  : 4:perl-libs-5.16.3-294.el7_6.x86_64                        18/59 
[00:00:34]   Verifying  : groff-base-1.22.2-8.el7.x86_64                             19/59 
[00:00:34]   Verifying  : perl-Thread-Queue-3.02-2.el7.noarch                        20/59 
[00:00:34]   Verifying  : perl-File-Temp-0.23.01-3.el7.noarch                        21/59 
[00:00:34]   Verifying  : 1:perl-Pod-Simple-3.28-4.el7.noarch                        22/59 
[00:00:34]   Verifying  : dwz-0.11-3.el7.x86_64                                      23/59 
[00:00:34]   Verifying  : perl-Time-Local-1.2300-2.el7.noarch                        24/59 
[00:00:34]   Verifying  : gdb-7.6.1-114.el7.x86_64                                   25/59 
[00:00:34]   Verifying  : perl-Text-ParseWords-3.29-4.el7.noarch                     26/59 
[00:00:34]   Verifying  : redhat-rpm-config-9.1.0-87.el7.centos.noarch               27/59 
[00:00:34]   Verifying  : perl-srpm-macros-1-8.el7.noarch                            28/59 
[00:00:34]   Verifying  : 4:perl-macros-5.16.3-294.el7_6.x86_64                      29/59 
[00:00:34]   Verifying  : perl-Socket-2.010-4.el7.x86_64                             30/59 
[00:00:34]   Verifying  : rpm-sign-4.11.3-35.el7.x86_64                              31/59 
[00:00:34]   Verifying  : glibc-devel-2.17-260.el7_6.3.x86_64                        32/59 
[00:00:34]   Verifying  : file-5.11-35.el7.x86_64                                    33/59 
[00:00:34]   Verifying  : cpp-4.8.5-36.el7.x86_64                                    34/59 
[00:00:34]   Verifying  : libgomp-4.8.5-36.el7.x86_64                                35/59 
[00:00:34]   Verifying  : perl-podlators-2.5.1-3.el7.noarch                          36/59 
[00:00:34]   Verifying  : libxml2-python-2.9.1-6.el7_2.3.x86_64                      37/59 
[00:00:34]   Verifying  : deltarpm-3.6-3.el7.x86_64                                  38/59 
[00:00:34]   Verifying  : perl-Storable-2.45-3.el7.x86_64                            39/59 
[00:00:34]   Verifying  : createrepo-0.9.9-28.el7.noarch                             40/59 
[00:00:34]   Verifying  : perl-Scalar-List-Utils-1.27-248.el7.x86_64                 41/59 
[00:00:34]   Verifying  : 1:make-3.82-23.el7.x86_64                                  42/59 
[00:00:34]   Verifying  : libmpc-1.0.1-3.el7.x86_64                                  43/59 
[00:00:34]   Verifying  : rsync-3.1.2-4.el7.x86_64                                   44/59 
[00:00:34]   Verifying  : perl-Pod-Usage-1.63-3.el7.noarch                           45/59 
[00:00:34]   Verifying  : glibc-headers-2.17-260.el7_6.3.x86_64                      46/59 
[00:00:34]   Verifying  : perl-Encode-2.51-7.el7.x86_64                              47/59 
[00:00:34]   Verifying  : yum-utils-1.1.31-50.el7.noarch                             48/59 
[00:00:34]   Verifying  : python-deltarpm-3.6-3.el7.x86_64                           49/59 
[00:00:34]   Verifying  : perl-File-Path-2.09-2.el7.noarch                           50/59 
[00:00:34]   Verifying  : zip-3.0-11.el7.x86_64                                      51/59 
[00:00:34]   Verifying  : mpfr-3.1.1-4.el7.x86_64                                    52/59 
[00:00:34]   Verifying  : python-chardet-2.2.1-1.el7_1.noarch                        53/59 
[00:00:34]   Verifying  : perl-Filter-1.49-3.el7.x86_64                              54/59 
[00:00:34]   Verifying  : perl-Getopt-Long-2.40-3.el7.noarch                         55/59 
[00:00:34]   Verifying  : python-kitchen-1.1.1-5.el7.noarch                          56/59 
[00:00:34]   Verifying  : 4:perl-5.16.3-294.el7_6.x86_64                             57/59 
[00:00:34]   Verifying  : patch-2.7.1-10.el7_5.x86_64                                58/59 
[00:00:35]   Verifying  : elfutils-0.172-2.el7.x86_64                                59/59 
[00:00:35] 
[00:00:35] Installed:
[00:00:35]   createrepo.noarch 0:0.9.9-28.el7 gcc.x86_64 0:4.8.5-36.el7                   
[00:00:35]   make.x86_64 1:3.82-23.el7        perl.x86_64 4:5.16.3-294.el7_6              
[00:00:35]   rpm-build.x86_64 0:4.11.3-35.el7 rpm-sign.x86_64 0:4.11.3-35.el7             
[00:00:35]   rsync.x86_64 0:3.1.2-4.el7       yum-plugin-priorities.noarch 0:1.1.31-50.el7
[00:00:35]   yum-utils.noarch 0:1.1.31-50.el7
[00:00:35] 
[00:00:35] Dependency Installed:
[00:00:35]   bzip2.x86_64 0:1.0.6-13.el7                                                   
[00:00:35]   cpp.x86_64 0:4.8.5-36.el7                                                     
[00:00:35]   deltarpm.x86_64 0:3.6-3.el7                                                   
[00:00:35]   dwz.x86_64 0:0.11-3.el7                                                       
[00:00:35]   elfutils.x86_64 0:0.172-2.el7                                                 
[00:00:35]   file.x86_64 0:5.11-35.el7                                                     
[00:00:35]   gdb.x86_64 0:7.6.1-114.el7                                                    
[00:00:35]   glibc-devel.x86_64 0:2.17-260.el7_6.3                                         
[00:00:35]   glibc-headers.x86_64 0:2.17-260.el7_6.3                                       
[00:00:35]   groff-base.x86_64 0:1.22.2-8.el7                                              
[00:00:35]   kernel-headers.x86_64 0:3.10.0-957.5.1.el7                                    
[00:00:35]   libgomp.x86_64 0:4.8.5-36.el7                                                 
[00:00:35]   libmpc.x86_64 0:1.0.1-3.el7                                                   
[00:00:35]   libxml2-python.x86_64 0:2.9.1-6.el7_2.3                                       
[00:00:35]   mpfr.x86_64 0:3.1.1-4.el7                                                     
[00:00:35]   patch.x86_64 0:2.7.1-10.el7_5                                                 
[00:00:35]   perl-Carp.noarch 0:1.26-244.el7                                               
[00:00:35]   perl-Encode.x86_64 0:2.51-7.el7                                               
[00:00:35]   perl-Exporter.noarch 0:5.68-3.el7                                             
[00:00:35]   perl-File-Path.noarch 0:2.09-2.el7                                            
[00:00:35]   perl-File-Temp.noarch 0:0.23.01-3.el7                                         
[00:00:35]   perl-Filter.x86_64 0:1.49-3.el7                                               
[00:00:35]   perl-Getopt-Long.noarch 0:2.40-3.el7                                          
[00:00:35]   perl-HTTP-Tiny.noarch 0:0.033-3.el7                                           
[00:00:35]   perl-PathTools.x86_64 0:3.40-5.el7                                            
[00:00:35]   perl-Pod-Escapes.noarch 1:1.04-294.el7_6                                      
[00:00:35]   perl-Pod-Perldoc.noarch 0:3.20-4.el7                                          
[00:00:35]   perl-Pod-Simple.noarch 1:3.28-4.el7                                           
[00:00:35]   perl-Pod-Usage.noarch 0:1.63-3.el7                                            
[00:00:35]   perl-Scalar-List-Utils.x86_64 0:1.27-248.el7                                  
[00:00:35]   perl-Socket.x86_64 0:2.010-4.el7                                              
[00:00:35]   perl-Storable.x86_64 0:2.45-3.el7                                             
[00:00:35]   perl-Text-ParseWords.noarch 0:3.29-4.el7                                      
[00:00:35]   perl-Thread-Queue.noarch 0:3.02-2.el7                                         
[00:00:35]   perl-Time-HiRes.x86_64 4:1.9725-3.el7                                         
[00:00:35]   perl-Time-Local.noarch 0:1.2300-2.el7                                         
[00:00:35]   perl-constant.noarch 0:1.27-2.el7                                             
[00:00:35]   perl-libs.x86_64 4:5.16.3-294.el7_6                                           
[00:00:35]   perl-macros.x86_64 4:5.16.3-294.el7_6                                         
[00:00:35]   perl-parent.noarch 1:0.225-244.el7                                            
[00:00:35]   perl-podlators.noarch 0:2.5.1-3.el7                                           
[00:00:35]   perl-srpm-macros.noarch 0:1-8.el7                                             
[00:00:35]   perl-threads.x86_64 0:1.87-4.el7                                              
[00:00:35]   perl-threads-shared.x86_64 0:1.43-6.el7                                       
[00:00:35]   python-chardet.noarch 0:2.2.1-1.el7_1                                         
[00:00:35]   python-deltarpm.x86_64 0:3.6-3.el7                                            
[00:00:35]   python-kitchen.noarch 0:1.1.1-5.el7                                           
[00:00:35]   redhat-rpm-config.noarch 0:9.1.0-87.el7.centos                                
[00:00:35]   unzip.x86_64 0:6.0-19.el7                                                     
[00:00:35]   zip.x86_64 0:3.0-11.el7                                                       
[00:00:35] 
[00:00:35] Complete!
[00:00:35] 0
[00:00:35] now running: ssh -f -o "StrictHostKeyChecking no" -o Port=22 -i /etc/lightbuildserver/container/container_rsa root@10.0.3.5 "export LC_ALL=C; (if [ -f /etc/yum.repos.d/CentOS-Sources.repo ]; then rm -Rf /etc/yum.repos.d/CentOS-Sources.repo; fi) 2>&1 && echo \$?"
[00:00:35] 0
[00:00:35] now running: ssh -f -o "StrictHostKeyChecking no" -o Port=22 -i /etc/lightbuildserver/container/container_rsa root@10.0.3.5 "export LC_ALL=C; (if [ -f /etc/yum.repos.d/CentOS-Vault.repo ]; then rm -Rf /etc/yum.repos.d/CentOS-Vault.repo; fi) 2>&1 && echo \$?"
[00:00:35] 0
[00:00:35] now running: ssh -f -o "StrictHostKeyChecking no" -o Port=22 -i /etc/lightbuildserver/container/container_rsa root@10.0.3.5 "export LC_ALL=C; (mkdir -p rpmbuild/{BUILD,RPMS,SOURCES,SPECS,SRPMS}) 2>&1 && echo \$?"
[00:00:35] 0
[00:00:36] now running: rsync -avz --delete -e "ssh -i /etc/lightbuildserver/container/container_rsa -p 2222" /var/lib/lightbuildserver/src/tbits.net/lbs-TBitsKolab16Dev root@build04lxc.lbs.solidcharity.com:/var/lib/lxc/005-build04lxc.lbs.solidcharity.com/rootfs/root
[00:00:36] sending incremental file list
[00:00:36] lbs-TBitsKolab16Dev/
[00:00:36] lbs-TBitsKolab16Dev/Readme.md
[00:00:36] lbs-TBitsKolab16Dev/config.yml
[00:00:36] lbs-TBitsKolab16Dev/chwala/
[00:00:36] lbs-TBitsKolab16Dev/chwala/chwala-0.5.4-suhosin.session.encrypt-php_flag.patch
[00:00:36] lbs-TBitsKolab16Dev/chwala/chwala-0.5.4.tar.gz
[00:00:36] lbs-TBitsKolab16Dev/chwala/chwala.logrotate
[00:00:36] lbs-TBitsKolab16Dev/chwala/chwala.spec
[00:00:36] lbs-TBitsKolab16Dev/chwala/fix-autoload-path-debian.patch
[00:00:36] lbs-TBitsKolab16Dev/cyrus-imapd/
[00:00:36] lbs-TBitsKolab16Dev/cyrus-imapd/0001-dlist-Use-int8_t-in-dlist_parsemap.patch
[00:00:36] lbs-TBitsKolab16Dev/cyrus-imapd/0002-Avoid-returning-1-as-255.patch
[00:00:36] lbs-TBitsKolab16Dev/cyrus-imapd/cyr_systemd_helper
[00:00:36] lbs-TBitsKolab16Dev/cyrus-imapd/cyrus-imapd-2.5.12.25.tar.gz
[00:00:36] lbs-TBitsKolab16Dev/cyrus-imapd/cyrus-imapd.cron-daily
[00:00:36] lbs-TBitsKolab16Dev/cyrus-imapd/cyrus-imapd.cvt_cyrusdb_all
[00:00:36] lbs-TBitsKolab16Dev/cyrus-imapd/cyrus-imapd.imap-2.3.x-conf
[00:00:36] lbs-TBitsKolab16Dev/cyrus-imapd/cyrus-imapd.init
[00:00:36] lbs-TBitsKolab16Dev/cyrus-imapd/cyrus-imapd.logrotate
[00:00:36] lbs-TBitsKolab16Dev/cyrus-imapd/cyrus-imapd.magic
[00:00:36] lbs-TBitsKolab16Dev/cyrus-imapd/cyrus-imapd.pam-config
[00:00:36] lbs-TBitsKolab16Dev/cyrus-imapd/cyrus-imapd.service
[00:00:36] lbs-TBitsKolab16Dev/cyrus-imapd/cyrus-imapd.spec
[00:00:36] lbs-TBitsKolab16Dev/cyrus-imapd/cyrus-imapd.sysconfig
[00:00:36] lbs-TBitsKolab16Dev/cyrus-imapd/cyrus-imapd.upstream
[00:00:36] lbs-TBitsKolab16Dev/cyrus-imapd/cyrus_canonification_multiple_domains.patch
[00:00:36] lbs-TBitsKolab16Dev/cyrus-imapd/cyrus_filter_kolab_mailboxes.patch
[00:00:36] lbs-TBitsKolab16Dev/iRony/
[00:00:36] lbs-TBitsKolab16Dev/iRony/add-sabre21-path-for-debian.patch
[00:00:36] lbs-TBitsKolab16Dev/iRony/iRony-0.4.1.tar.gz
[00:00:36] lbs-TBitsKolab16Dev/iRony/iRony.conf
[00:00:36] lbs-TBitsKolab16Dev/iRony/iRony.logrotate
[00:00:36] lbs-TBitsKolab16Dev/iRony/iRony.spec
[00:00:36] lbs-TBitsKolab16Dev/kolab-autoconf/
[00:00:36] lbs-TBitsKolab16Dev/kolab-autoconf/kolab-autoconf-1.3.tar.gz
[00:00:36] lbs-TBitsKolab16Dev/kolab-autoconf/kolab-autoconf.spec
[00:00:36] lbs-TBitsKolab16Dev/kolab-freebusy/
[00:00:36] lbs-TBitsKolab16Dev/kolab-freebusy/kolab-freebusy-1.1.1.tar.gz
[00:00:36] lbs-TBitsKolab16Dev/kolab-freebusy/kolab-freebusy.conf
[00:00:36] lbs-TBitsKolab16Dev/kolab-freebusy/kolab-freebusy.logrotate
[00:00:36] lbs-TBitsKolab16Dev/kolab-freebusy/kolab-freebusy.spec
[00:00:36] lbs-TBitsKolab16Dev/kolab-schema/
[00:00:36] lbs-TBitsKolab16Dev/kolab-schema/kolab-schema-3.3.tar.gz
[00:00:36] lbs-TBitsKolab16Dev/kolab-schema/kolab-schema.spec
[00:00:36] lbs-TBitsKolab16Dev/kolab-syncroton/
[00:00:36] lbs-TBitsKolab16Dev/kolab-syncroton/kolab-syncroton-2.3.15.tar.gz
[00:00:36] lbs-TBitsKolab16Dev/kolab-syncroton/kolab-syncroton.logrotate
[00:00:36] lbs-TBitsKolab16Dev/kolab-syncroton/kolab-syncroton.spec
[00:00:36] lbs-TBitsKolab16Dev/kolab-utils/
[00:00:36] lbs-TBitsKolab16Dev/kolab-utils/0002-no-tests-for-fbdaemon.patch
[00:00:36] lbs-TBitsKolab16Dev/kolab-utils/kolab-utils-3.1.4.tar.gz
[00:00:36] lbs-TBitsKolab16Dev/kolab-utils/kolab-utils.spec
[00:00:36] lbs-TBitsKolab16Dev/kolab-webadmin/
[00:00:36] lbs-TBitsKolab16Dev/kolab-webadmin/99tbits.ldif
[00:00:36] lbs-TBitsKolab16Dev/kolab-webadmin/canonification_via_uid_wap.patch
[00:00:36] lbs-TBitsKolab16Dev/kolab-webadmin/domainAdminDefaultQuota.patch
[00:00:36] lbs-TBitsKolab16Dev/kolab-webadmin/domainAdminMaxAccounts.patch
[00:00:36] lbs-TBitsKolab16Dev/kolab-webadmin/domainquotaBug2046.patch
[00:00:36] lbs-TBitsKolab16Dev/kolab-webadmin/dont_generate_attribs_when_editing.patch
[00:00:36] lbs-TBitsKolab16Dev/kolab-webadmin/initTBitsUserTypes.php
[00:00:36] lbs-TBitsKolab16Dev/kolab-webadmin/intranetToken-wap.patch
[00:00:36] lbs-TBitsKolab16Dev/kolab-webadmin/kolab-webadmin-3.2.12.tar.gz
[00:00:36] lbs-TBitsKolab16Dev/kolab-webadmin/kolab-webadmin.spec
[00:00:36] lbs-TBitsKolab16Dev/kolab-webadmin/kolab-webadmin.upstream
[00:00:36] lbs-TBitsKolab16Dev/kolab-webadmin/lastLoginTBitsAttribute-wap.patch
[00:00:36] lbs-TBitsKolab16Dev/kolab-webadmin/listUsersLastLoginQuotaUsage.patch
[00:00:36] lbs-TBitsKolab16Dev/kolab-webadmin/patchMultiDomainAdminsBug2018.patch
[00:00:36] lbs-TBitsKolab16Dev/kolab-webadmin/quotaused_wap.patch
[00:00:36] lbs-TBitsKolab16Dev/kolab-webadmin/validateAliasDomainPostfixVirtualFileBug2658.patch
[00:00:36] lbs-TBitsKolab16Dev/kolab-webadmin/wap_api_listuserswithhash.patch
[00:00:36] lbs-TBitsKolab16Dev/kolab-webadmin/wap_disallow_users.patch
[00:00:36] lbs-TBitsKolab16Dev/kolab/
[00:00:36] lbs-TBitsKolab16Dev/kolab/README
[00:00:36] lbs-TBitsKolab16Dev/kolab/kolab-16.0.1.tar.gz
[00:00:36] lbs-TBitsKolab16Dev/kolab/kolab.spec
[00:00:36] lbs-TBitsKolab16Dev/kolab/kolab.upstream
[00:00:36] lbs-TBitsKolab16Dev/libcalendaring/
[00:00:36] lbs-TBitsKolab16Dev/libcalendaring/0001-Correct-shebangs.patch
[00:00:36] lbs-TBitsKolab16Dev/libcalendaring/0002-ical3-support.patch
[00:00:36] lbs-TBitsKolab16Dev/libcalendaring/libcalendaring-4.9.2.tar.gz
[00:00:37] lbs-TBitsKolab16Dev/libcalendaring/libcalendaring.spec
[00:00:37] lbs-TBitsKolab16Dev/libkolab/
[00:00:37] lbs-TBitsKolab16Dev/libkolab/libkolab-0.4.2-cmake-2.8.11.patch
[00:00:37] lbs-TBitsKolab16Dev/libkolab/libkolab-0.5-swigutils.cmake.patch
[00:00:37] lbs-TBitsKolab16Dev/libkolab/libkolab-2.0.tar.gz
[00:00:37] lbs-TBitsKolab16Dev/libkolab/libkolab.spec
[00:00:37] lbs-TBitsKolab16Dev/libkolabxml/
[00:00:37] lbs-TBitsKolab16Dev/libkolabxml/at11.0-boost-this_thread-hidden-sleep_until.patch
[00:00:37] lbs-TBitsKolab16Dev/libkolabxml/fix-qverify-argument.patch
[00:00:37] lbs-TBitsKolab16Dev/libkolabxml/libkolabxml-1.2.tar.gz
[00:00:37] lbs-TBitsKolab16Dev/libkolabxml/libkolabxml.spec
[00:00:37] lbs-TBitsKolab16Dev/libkolabxml/libossp-uuid-include.patch
[00:00:37] lbs-TBitsKolab16Dev/mozldap/
[00:00:37] lbs-TBitsKolab16Dev/mozldap/debian-aggregate.patch
[00:00:37] lbs-TBitsKolab16Dev/mozldap/mozldap-6.0.7.tar.gz
[00:00:37] lbs-TBitsKolab16Dev/mozldap/mozldap.spec
[00:00:37] lbs-TBitsKolab16Dev/php-christianriesen-base32/
[00:00:37] lbs-TBitsKolab16Dev/php-christianriesen-base32/christianriesen-base32-1.2.1.tar.gz
[00:00:37] lbs-TBitsKolab16Dev/php-christianriesen-base32/php-christianriesen-base32.spec
[00:00:37] lbs-TBitsKolab16Dev/php-endroid-qrcode/
[00:00:37] lbs-TBitsKolab16Dev/php-endroid-qrcode/endroid-qrcode-1.5.4.tar.gz
[00:00:37] lbs-TBitsKolab16Dev/php-endroid-qrcode/php-endroid-qrcode.spec
[00:00:37] lbs-TBitsKolab16Dev/php-enygma-yubikey/
[00:00:37] lbs-TBitsKolab16Dev/php-enygma-yubikey/enygma-yubikey-3.2.tar.gz
[00:00:37] lbs-TBitsKolab16Dev/php-enygma-yubikey/php-enygma-yubikey.spec
[00:00:37] lbs-TBitsKolab16Dev/php-sabre-dav/
[00:00:37] lbs-TBitsKolab16Dev/php-sabre-dav/0001-Use-homemade-autoload.php.patch
[00:00:37] lbs-TBitsKolab16Dev/php-sabre-dav/0002-Drop-Composer-autoLoader-calls.patch
[00:00:37] lbs-TBitsKolab16Dev/php-sabre-dav/0003-Increase-timeout.patch
[00:00:37] lbs-TBitsKolab16Dev/php-sabre-dav/0004-Install-sabredav.php-in-usr-share-php-sabre21-Sabre.patch
[00:00:37] lbs-TBitsKolab16Dev/php-sabre-dav/0005-tfix-threshold.patch
[00:00:37] lbs-TBitsKolab16Dev/php-sabre-dav/0006-tfix-selection.patch
[00:00:37] lbs-TBitsKolab16Dev/php-sabre-dav/0007-Rename-naturalselection-as-naturalselection21.patch
[00:00:37] lbs-TBitsKolab16Dev/php-sabre-dav/0008-Fix-upper-limit-after-spurious-upload-of-php-sabre-e.patch
[00:00:37] lbs-TBitsKolab16Dev/php-sabre-dav/0009-naturalselection.1-wfix.patch
[00:00:37] lbs-TBitsKolab16Dev/php-sabre-dav/autoload.php
[00:00:37] lbs-TBitsKolab16Dev/php-sabre-dav/php-sabre-dav.spec
[00:00:37] lbs-TBitsKolab16Dev/php-sabre-dav/sabre-dav-2.1.11.tar.gz
[00:00:37] lbs-TBitsKolab16Dev/php-sabre-event/
[00:00:37] lbs-TBitsKolab16Dev/php-sabre-event/php-sabre-event.spec
[00:00:37] lbs-TBitsKolab16Dev/php-sabre-event/sabre-event-2.0.2.tar.gz
[00:00:37] lbs-TBitsKolab16Dev/php-sabre-http/
[00:00:37] lbs-TBitsKolab16Dev/php-sabre-http/0001-Use-homemade-autoload.php.patch
[00:00:37] lbs-TBitsKolab16Dev/php-sabre-http/0002-Fix-upper-limit-after-spurious-upload-of-php-sabre-e.patch
[00:00:37] lbs-TBitsKolab16Dev/php-sabre-http/php-sabre-http.spec
[00:00:37] lbs-TBitsKolab16Dev/php-sabre-http/sabre-http-3.0.5.tar.gz
[00:00:37] lbs-TBitsKolab16Dev/php-sabre-vobject/
[00:00:37] lbs-TBitsKolab16Dev/php-sabre-vobject/0001-Use-homemade-autoloader.php.patch
[00:00:37] lbs-TBitsKolab16Dev/php-sabre-vobject/0002-replace-with-homemade-tests-autoloader.patch
[00:00:37] lbs-TBitsKolab16Dev/php-sabre-vobject/Canada-East-Saskatchewan-removed-in-2017.3.patch
[00:00:37] lbs-TBitsKolab16Dev/php-sabre-vobject/T41247.patch
[00:00:37] lbs-TBitsKolab16Dev/php-sabre-vobject/php-sabre-vobject.spec
[00:00:37] lbs-TBitsKolab16Dev/php-sabre-vobject/sabre-vobject-3.5.3.tar.gz
[00:00:37] lbs-TBitsKolab16Dev/php-sabre-vobject/sabre-vobject-bin.patch
[00:00:37] lbs-TBitsKolab16Dev/php-sabre-vobject/vobject_encoding_performance.patch
[00:00:37] lbs-TBitsKolab16Dev/php-spomky-labs-otphp/
[00:00:37] lbs-TBitsKolab16Dev/php-spomky-labs-otphp/php-spomky-labs-otphp.spec
[00:00:37] lbs-TBitsKolab16Dev/php-spomky-labs-otphp/spomky-labs-otphp-4.0.2.tar.gz
[00:00:37] lbs-TBitsKolab16Dev/pykolab/
[00:00:37] lbs-TBitsKolab16Dev/pykolab/allowPrimaryEmailAddressFromDomain.patch
[00:00:37] lbs-TBitsKolab16Dev/pykolab/canonification_via_uid_pykolab.patch
[00:00:37] lbs-TBitsKolab16Dev/pykolab/cyrus-imapd.conf-cert-paths.patch
[00:00:37] lbs-TBitsKolab16Dev/pykolab/disableSpamFilter.patch
[00:00:37] lbs-TBitsKolab16Dev/pykolab/disableSpamFilter2.patch
[00:00:37] lbs-TBitsKolab16Dev/pykolab/fixPykolabIMAPKeepAlive.patch
[00:00:37] lbs-TBitsKolab16Dev/pykolab/kolab_lam_invalid_mailbox_name.patch
[00:00:37] lbs-TBitsKolab16Dev/pykolab/lastLoginTBitsAttribute-pykolab.patch
[00:00:37] lbs-TBitsKolab16Dev/pykolab/logLoginData.patch
[00:00:37] lbs-TBitsKolab16Dev/pykolab/onlyAllowKolabUsersToAuthViaSasl.patch
[00:00:37] lbs-TBitsKolab16Dev/pykolab/pykolab-0.8-patch-out-manticore.patch
[00:00:37] lbs-TBitsKolab16Dev/pykolab/pykolab-0.8.10.tar.gz
[00:00:37] lbs-TBitsKolab16Dev/pykolab/pykolab.logrotate
[00:00:37] lbs-TBitsKolab16Dev/pykolab/pykolab.spec
[00:00:37] lbs-TBitsKolab16Dev/pykolab/pykolab.upstream
[00:00:37] lbs-TBitsKolab16Dev/pykolab/pykolab_do_not_rename_existing_mailbox_T3315.patch
[00:00:37] lbs-TBitsKolab16Dev/pykolab/pykolab_no_guam.patch
[00:00:37] lbs-TBitsKolab16Dev/pykolab/pykolab_wap_client_unverified_context_localhost.patch
[00:00:37] lbs-TBitsKolab16Dev/python-icalendar/
[00:00:37] lbs-TBitsKolab16Dev/python-icalendar/icalendar-3.8.2.tar.gz
[00:00:37] lbs-TBitsKolab16Dev/python-icalendar/python-icalendar.spec
[00:00:37] lbs-TBitsKolab16Dev/python-sievelib/
[00:00:37] lbs-TBitsKolab16Dev/python-sievelib/python-sievelib.spec
[00:00:37] lbs-TBitsKolab16Dev/python-sievelib/sievelib-0.5.2.tar.gz
[00:00:37] lbs-TBitsKolab16Dev/roundcubemail-plugin-contextmenu/
[00:00:37] lbs-TBitsKolab16Dev/roundcubemail-plugin-contextmenu/README
[00:00:37] lbs-TBitsKolab16Dev/roundcubemail-plugin-contextmenu/roundcubemail-plugin-contextmenu-2.3.tar.gz
[00:00:37] lbs-TBitsKolab16Dev/roundcubemail-plugin-contextmenu/roundcubemail-plugin-contextmenu.spec
[00:00:37] lbs-TBitsKolab16Dev/roundcubemail-plugin-ude_login/
[00:00:37] lbs-TBitsKolab16Dev/roundcubemail-plugin-ude_login/comm.py
[00:00:37] lbs-TBitsKolab16Dev/roundcubemail-plugin-ude_login/roundcubemail-plugin-ude_login-4.0.0.tar.gz
[00:00:37] lbs-TBitsKolab16Dev/roundcubemail-plugin-ude_login/roundcubemail-plugin-ude_login.spec
[00:00:37] lbs-TBitsKolab16Dev/roundcubemail-plugins-kolab/
[00:00:37] lbs-TBitsKolab16Dev/roundcubemail-plugins-kolab/0001-Fix-missing-first-occurrence-of-an-event-when-moved-.patch
[00:00:37] lbs-TBitsKolab16Dev/roundcubemail-plugins-kolab/canonification_via_uid_roundcube.patch
[00:00:37] lbs-TBitsKolab16Dev/roundcubemail-plugins-kolab/comm.py
[00:00:37] lbs-TBitsKolab16Dev/roundcubemail-plugins-kolab/plesk.calendar.inc.php
[00:00:37] lbs-TBitsKolab16Dev/roundcubemail-plugins-kolab/plesk.kolab_addressbook.inc.php
[00:00:37] lbs-TBitsKolab16Dev/roundcubemail-plugins-kolab/plesk.kolab_folders.inc.php
[00:00:37] lbs-TBitsKolab16Dev/roundcubemail-plugins-kolab/plesk.libkolab.inc.php
[00:00:37] lbs-TBitsKolab16Dev/roundcubemail-plugins-kolab/roundcubeStorageMariadbBug4883.patch
[00:00:37] lbs-TBitsKolab16Dev/roundcubemail-plugins-kolab/roundcube_calendar_etc_timezone_T2666.patch
[00:00:37] lbs-TBitsKolab16Dev/roundcubemail-plugins-kolab/roundcubemail-plugins-kolab-3.3-kolab-files-manticore-api.patch
[00:00:37] lbs-TBitsKolab16Dev/roundcubemail-plugins-kolab/roundcubemail-plugins-kolab-3.3.6.tar.gz
[00:00:37] lbs-TBitsKolab16Dev/roundcubemail-plugins-kolab/roundcubemail-plugins-kolab.spec
[00:00:37] lbs-TBitsKolab16Dev/roundcubemail-plugins-kolab/roundcubemail-plugins-kolab.upstream
[00:00:37] lbs-TBitsKolab16Dev/roundcubemail-skin-chameleon/
[00:00:37] lbs-TBitsKolab16Dev/roundcubemail-skin-chameleon/T4371.patch
[00:00:37] lbs-TBitsKolab16Dev/roundcubemail-skin-chameleon/roundcubemail-skin-chameleon-0.3.10.tar.gz
[00:00:37] lbs-TBitsKolab16Dev/roundcubemail-skin-chameleon/roundcubemail-skin-chameleon.spec
[00:00:37] lbs-TBitsKolab16Dev/roundcubemail/
[00:00:37] lbs-TBitsKolab16Dev/roundcubemail/0002-Parse-all-quotas-from-GETQUOTAROOT-6280.patch
[00:00:37] lbs-TBitsKolab16Dev/roundcubemail/0003-Update-changelog.patch
[00:00:37] lbs-TBitsKolab16Dev/roundcubemail/0004-Fix-bug-where-some-escape-sequences-in-html-styles-c.patch
[00:00:37] lbs-TBitsKolab16Dev/roundcubemail/0005-Fix-bug-where-some-forbidden-characters-on-Cyrus-IMA.patch
[00:00:37] lbs-TBitsKolab16Dev/roundcubemail/2017111400.sql
[00:00:37] lbs-TBitsKolab16Dev/roundcubemail/backport_managesieve_forwards.patch
[00:00:37] lbs-TBitsKolab16Dev/roundcubemail/comm.py
[00:00:37] lbs-TBitsKolab16Dev/roundcubemail/default-configuration.patch
[00:00:37] lbs-TBitsKolab16Dev/roundcubemail/optional_disable_addressbook_export.patch
[00:00:37] lbs-TBitsKolab16Dev/roundcubemail/plesk.config.inc.php
[00:00:37] lbs-TBitsKolab16Dev/roundcubemail/plesk.managesieve.inc.php
[00:00:37] lbs-TBitsKolab16Dev/roundcubemail/plesk.password.inc.php
[00:00:37] lbs-TBitsKolab16Dev/roundcubemail/roundcubemail-1.3.6-plugin-enigma-homedir.patch
[00:00:37] lbs-TBitsKolab16Dev/roundcubemail/roundcubemail-1.3.8.tar.gz
[00:00:38] lbs-TBitsKolab16Dev/roundcubemail/roundcubemail.conf
[00:00:38] lbs-TBitsKolab16Dev/roundcubemail/roundcubemail.logrotate
[00:00:38] lbs-TBitsKolab16Dev/roundcubemail/roundcubemail.spec
[00:00:38] lbs-TBitsKolab16Dev/roundcubemail/roundcubemail.upstream
[00:00:38] lbs-TBitsKolab16Dev/roundcubemail/roundcubemail_messages.patch
[00:00:38] lbs-TBitsKolab16Dev/updatePackages/
[00:00:38] lbs-TBitsKolab16Dev/updatePackages/backport_managesieve_forwards.patch
[00:00:38] lbs-TBitsKolab16Dev/updatePackages/checkVersions.sh
[00:00:38] lbs-TBitsKolab16Dev/updatePackages/comm.py
[00:00:38] lbs-TBitsKolab16Dev/updatePackages/cyrus-imapd.patch
[00:00:38] lbs-TBitsKolab16Dev/updatePackages/ical3-support.patch
[00:00:38] lbs-TBitsKolab16Dev/updatePackages/kolab-webadmin.patch
[00:00:38] lbs-TBitsKolab16Dev/updatePackages/kolab.patch
[00:00:38] lbs-TBitsKolab16Dev/updatePackages/pykolab.patch
[00:00:38] lbs-TBitsKolab16Dev/updatePackages/pykolab_no_guam.patch
[00:00:38] lbs-TBitsKolab16Dev/updatePackages/roundcubemail-1.3.8.tar.gz
[00:00:38] lbs-TBitsKolab16Dev/updatePackages/roundcubemail-plugins-kolab.patch
[00:00:38] lbs-TBitsKolab16Dev/updatePackages/roundcubemail.patch
[00:00:38] lbs-TBitsKolab16Dev/updatePackages/roundcubemail_messages.patch
[00:00:38] lbs-TBitsKolab16Dev/updatePackages/setup.sh
[00:00:38] 
[00:00:38] sent 50,499,896 bytes  received 3,908 bytes  20,201,521.60 bytes/sec
[00:00:38] total size is 51,622,219  speedup is 1.02
[00:00:38] now running: ssh -f -o "StrictHostKeyChecking no" -o Port=22 -i /etc/lightbuildserver/container/container_rsa root@10.0.3.5 "export LC_ALL=C; (if [ ! -f /etc/yum.repos.d/epel-release.repo ]; then exit -1; fi) 2>&1 && echo \$?"
[00:00:38] now running: ssh -f -o "StrictHostKeyChecking no" -o Port=22 -i /etc/lightbuildserver/container/container_rsa root@10.0.3.5 "export LC_ALL=C; (yum -y install epel-release) 2>&1 && echo \$?"
[00:00:38] Loaded plugins: fastestmirror, priorities
[00:00:38] Loading mirror speeds from cached hostfile
[00:00:38]  * base: centosmirror.netcup.net
[00:00:38]  * extras: mirror.imt-systems.com
[00:00:38]  * updates: mirror.ratiokontakt.de
[00:00:38] Resolving Dependencies
[00:00:38] --> Running transaction check
[00:00:38] ---> Package epel-release.noarch 0:7-11 will be installed
[00:00:39] --> Finished Dependency Resolution
[00:00:39] 
[00:00:39] Dependencies Resolved
[00:00:39] 
[00:00:39] ================================================================================
[00:00:39]  Package                Arch             Version         Repository        Size
[00:00:39] ================================================================================
[00:00:39] Installing:
[00:00:39]  epel-release           noarch           7-11            extras            15 k
[00:00:39] 
[00:00:39] Transaction Summary
[00:00:39] ================================================================================
[00:00:39] Install  1 Package
[00:00:39] 
[00:00:39] Total size: 15 k
[00:00:39] Installed size: 24 k
[00:00:39] Downloading packages:
[00:00:39] Running transaction check
[00:00:39] Running transaction test
[00:00:39] Transaction test succeeded
[00:00:39] Running transaction
[00:00:39]   Installing : epel-release-7-11.noarch                                     1/1 
[00:00:39]   Verifying  : epel-release-7-11.noarch                                     1/1 
[00:00:39] 
[00:00:39] Installed:
[00:00:39]   epel-release.noarch 0:7-11                                                    
[00:00:39] 
[00:00:39] Complete!
[00:00:39] 0
[00:00:39] now running: rsync -avz --delete -e "ssh -i /etc/lightbuildserver/container/container_rsa -p 2222" /var/lib/lightbuildserver/repos/tbits.net/TBitsKolab16Dev/centos/7/lbs-tbits.net-TBitsKolab16Dev.repo root@build04lxc.lbs.solidcharity.com:/var/lib/lxc/005-build04lxc.lbs.solidcharity.com/rootfs/etc/yum.repos.d
[00:00:39] sending incremental file list
[00:00:39] lbs-tbits.net-TBitsKolab16Dev.repo
[00:00:39] 
[00:00:39] sent 252 bytes  received 35 bytes  574.00 bytes/sec
[00:00:39] total size is 166  speedup is 0.58
[00:00:39] now running: ssh -f -o "StrictHostKeyChecking no" -o Port=22 -i /etc/lightbuildserver/container/container_rsa root@10.0.3.5 "export LC_ALL=C; (echo "priority = 60" >> /etc/yum.repos.d/lbs-tbits.net-TBitsKolab16Dev.repo) 2>&1 && echo \$?"
[00:00:39] 0
[00:00:39] now running: ssh -f -o "StrictHostKeyChecking no" -o Port=22 -i /etc/lightbuildserver/container/container_rsa root@10.0.3.5 "export LC_ALL=C; (yum clean metadata) 2>&1 && echo \$?"
[00:00:39] Loaded plugins: fastestmirror, priorities
[00:00:39] Cleaning repos: base epel extras lbs-tbits.net-TBitsKolab16Dev updates
[00:00:40] 17 metadata files removed
[00:00:40] 10 sqlite files removed
[00:00:40] 0 metadata files removed
[00:00:40] 0
[00:00:40] now running: ssh -f -o "StrictHostKeyChecking no" -o Port=22 -i /etc/lightbuildserver/container/container_rsa root@10.0.3.5 "export LC_ALL=C; (sed -e 's/Release:.*%{release}/Release: 0/g' lbs-TBitsKolab16Dev/kolab/kolab.spec > /tmp/kolab.spec) 2>&1 && echo \$?"
[00:00:40] 0
[00:00:40] now running: ssh -f -o "StrictHostKeyChecking no" -o Port=22 -i /etc/lightbuildserver/container/container_rsa root@10.0.3.5 "export LC_ALL=C; (yum-builddep -y /tmp/kolab.spec) 2>&1 && echo \$?"
[00:00:40] Loaded plugins: fastestmirror, priorities
[00:00:40] Enabling epel-source repository
[00:00:40] Loading mirror speeds from cached hostfile
[00:00:45]  * base: centos.copahost.com
[00:00:45]  * epel: mirror.nextlayer.at
[00:00:45]  * epel-source: mirror.nextlayer.at
[00:00:45]  * extras: ftp.antilo.de
[00:00:45]  * updates: mirror.ratiokontakt.de
[00:00:52] 13 packages excluded due to repository priority protections
[00:00:52] Checking for new repos for mirrors
[00:00:52] Getting requirements for /tmp/kolab.spec
[00:00:52] No uninstalled build requires
[00:00:52] 0
[00:00:52] now running: ssh -f -o "StrictHostKeyChecking no" -o Port=22 -i /etc/lightbuildserver/container/container_rsa root@10.0.3.5 "export LC_ALL=C; (mydevice=\`ip -o route get to 8.8.8.8 | awk '{ print \$5 }'\`; myip=\`ip -o route get to 8.8.8.8 | awk '{ print \$7 }'\`; ip route add \$myip dev \$mydevice) 2>&1 && echo \$?"
[00:00:52] 0
[00:00:52] now running: ssh -f -o "StrictHostKeyChecking no" -o Port=22 -i /etc/lightbuildserver/container/container_rsa root@10.0.3.5 "export LC_ALL=C; (sed -i "s/0%{?suse_version}/0/g" lbs-TBitsKolab16Dev/kolab/kolab.spec) 2>&1 && echo \$?"
[00:00:52] 0
[00:00:52] now running: ssh -f -o "StrictHostKeyChecking no" -o Port=22 -i /etc/lightbuildserver/container/container_rsa root@10.0.3.5 "export LC_ALL=C; (cp lbs-TBitsKolab16Dev/kolab/kolab.spec rpmbuild/SPECS) 2>&1 && echo \$?"
[00:00:52] 0
[00:00:52] now running: ssh -f -o "StrictHostKeyChecking no" -o Port=22 -i /etc/lightbuildserver/container/container_rsa root@10.0.3.5 "export LC_ALL=C; (cp lbs-TBitsKolab16Dev/kolab/* rpmbuild/SOURCES) 2>&1 && echo \$?"
[00:00:52] 0
[00:00:52] now running: ssh -f -o "StrictHostKeyChecking no" -o Port=22 -i /etc/lightbuildserver/container/container_rsa root@10.0.3.5 "export LC_ALL=C; (mv sources/* rpmbuild/SOURCES) 2>&1 && echo \$?"
[00:00:53] mv: cannot stat 'sources/*': No such file or directory
[00:00:53] now running: rsync -avz -e "ssh -i /etc/lightbuildserver/container/container_rsa -p 2222" root@build04lxc.lbs.solidcharity.com:/var/lib/lxc/005-build04lxc.lbs.solidcharity.com/rootfs/root/rpmbuild/SPECS/kolab.spec /tmp/tmp29vg6npj
[00:00:53] receiving incremental file list
[00:00:53] kolab.spec
[00:00:53] 
[00:00:53] sent 43 bytes  received 2,198 bytes  4,482.00 bytes/sec
[00:00:53] total size is 7,777  speedup is 3.47
[00:00:53] now running: ssh -f -o "StrictHostKeyChecking no" -o Port=22 -i /etc/lightbuildserver/container/container_rsa root@10.0.3.5 "export LC_ALL=C; (sed -i -e 's/Release:.*%{release}/Release: 0/g' rpmbuild/SPECS/kolab.spec) 2>&1 && echo \$?"
[00:00:53] 0
[00:00:53] now running: ssh -f -o "StrictHostKeyChecking no" -o Port=22 -i /etc/lightbuildserver/container/container_rsa root@10.0.3.5 "export LC_ALL=C; (rpmbuild -ba rpmbuild/SPECS/kolab.spec) 2>&1 && echo \$?"
[00:00:53] Executing(%prep): /bin/sh -e /var/tmp/rpm-tmp.bK2DSH
[00:00:53] + umask 022
[00:00:53] + cd /root/rpmbuild/BUILD
[00:00:53] + cd /root/rpmbuild/BUILD
[00:00:53] + rm -rf kolab-16.0.1
[00:00:53] + /usr/bin/gzip -dc /root/rpmbuild/SOURCES/kolab-16.0.1.tar.gz
[00:00:53] + /usr/bin/tar -xf -
[00:00:53] + STATUS=0
[00:00:53] + '[' 0 -ne 0 ']'
[00:00:53] + cd kolab-16.0.1
[00:00:53] + /usr/bin/chmod -Rf a+rX,u+w,g-w,o-w .
[00:00:53] + exit 0
[00:00:53] Executing(%build): /bin/sh -e /var/tmp/rpm-tmp.dqyyL1
[00:00:53] + umask 022
[00:00:53] + cd /root/rpmbuild/BUILD
[00:00:53] + cd kolab-16.0.1
[00:00:53] + exit 0
[00:00:53] Executing(%install): /bin/sh -e /var/tmp/rpm-tmp.FBubFl
[00:00:53] + umask 022
[00:00:53] + cd /root/rpmbuild/BUILD
[00:00:53] + '[' /root/rpmbuild/BUILDROOT/kolab-16.0.1-107.tbits20190308.el7.x86_64 '!=' / ']'
[00:00:53] + rm -rf /root/rpmbuild/BUILDROOT/kolab-16.0.1-107.tbits20190308.el7.x86_64
[00:00:53] ++ dirname /root/rpmbuild/BUILDROOT/kolab-16.0.1-107.tbits20190308.el7.x86_64
[00:00:53] + mkdir -p /root/rpmbuild/BUILDROOT
[00:00:53] + mkdir /root/rpmbuild/BUILDROOT/kolab-16.0.1-107.tbits20190308.el7.x86_64
[00:00:53] + cd kolab-16.0.1
[00:00:53] + /usr/lib/rpm/check-buildroot
[00:00:53] + /usr/lib/rpm/redhat/brp-compress
[00:00:53] + /usr/lib/rpm/redhat/brp-strip /usr/bin/strip
[00:00:53] + /usr/lib/rpm/redhat/brp-strip-comment-note /usr/bin/strip /usr/bin/objdump
[00:00:53] + /usr/lib/rpm/redhat/brp-strip-static-archive /usr/bin/strip
[00:00:53] + /usr/lib/rpm/brp-python-bytecompile /usr/bin/python 1
[00:00:53] + /usr/lib/rpm/redhat/brp-python-hardlink
[00:00:53] + /usr/lib/rpm/redhat/brp-java-repack-jars
[00:00:53] Processing files: kolab-16.0.1-107.tbits20190308.el7.x86_64
[00:00:53] Executing(%doc): /bin/sh -e /var/tmp/rpm-tmp.PdZsTF
[00:00:53] + umask 022
[00:00:53] + cd /root/rpmbuild/BUILD
[00:00:53] + cd kolab-16.0.1
[00:00:53] + DOCDIR=/root/rpmbuild/BUILDROOT/kolab-16.0.1-107.tbits20190308.el7.x86_64/usr/share/doc/kolab-16.0.1
[00:00:53] + export DOCDIR
[00:00:53] + /usr/bin/mkdir -p /root/rpmbuild/BUILDROOT/kolab-16.0.1-107.tbits20190308.el7.x86_64/usr/share/doc/kolab-16.0.1
[00:00:53] + cp -pr README /root/rpmbuild/BUILDROOT/kolab-16.0.1-107.tbits20190308.el7.x86_64/usr/share/doc/kolab-16.0.1
[00:00:53] + exit 0
[00:00:53] Provides: kolab = 16.0.1-107.tbits20190308.el7 kolab(x86-64) = 16.0.1-107.tbits20190308.el7
[00:00:53] Requires(rpmlib): rpmlib(CompressedFileNames) <= 3.0.4-1 rpmlib(FileDigests) <= 4.6.0-1 rpmlib(PayloadFilesHavePrefix) <= 4.0-1
[00:00:53] Processing files: kolab-conf-16.0.1-107.tbits20190308.el7.x86_64
[00:00:53] Executing(%doc): /bin/sh -e /var/tmp/rpm-tmp.zzOu9Z
[00:00:53] + umask 022
[00:00:53] + cd /root/rpmbuild/BUILD
[00:00:53] + cd kolab-16.0.1
[00:00:53] + DOCDIR=/root/rpmbuild/BUILDROOT/kolab-16.0.1-107.tbits20190308.el7.x86_64/usr/share/doc/kolab-conf-16.0.1
[00:00:53] + export DOCDIR
[00:00:53] + /usr/bin/mkdir -p /root/rpmbuild/BUILDROOT/kolab-16.0.1-107.tbits20190308.el7.x86_64/usr/share/doc/kolab-conf-16.0.1
[00:00:53] + cp -pr README /root/rpmbuild/BUILDROOT/kolab-16.0.1-107.tbits20190308.el7.x86_64/usr/share/doc/kolab-conf-16.0.1
[00:00:53] + exit 0
[00:00:53] Provides: kolab-conf = 16.0.1-107.tbits20190308.el7 kolab-conf(x86-64) = 16.0.1-107.tbits20190308.el7
[00:00:53] Requires(rpmlib): rpmlib(CompressedFileNames) <= 3.0.4-1 rpmlib(FileDigests) <= 4.6.0-1 rpmlib(PayloadFilesHavePrefix) <= 4.0-1
[00:00:53] Processing files: kolab-imap-16.0.1-107.tbits20190308.el7.x86_64
[00:00:53] Executing(%doc): /bin/sh -e /var/tmp/rpm-tmp.e0MErk
[00:00:53] + umask 022
[00:00:53] + cd /root/rpmbuild/BUILD
[00:00:53] + cd kolab-16.0.1
[00:00:53] + DOCDIR=/root/rpmbuild/BUILDROOT/kolab-16.0.1-107.tbits20190308.el7.x86_64/usr/share/doc/kolab-imap-16.0.1
[00:00:53] + export DOCDIR
[00:00:53] + /usr/bin/mkdir -p /root/rpmbuild/BUILDROOT/kolab-16.0.1-107.tbits20190308.el7.x86_64/usr/share/doc/kolab-imap-16.0.1
[00:00:53] + cp -pr README /root/rpmbuild/BUILDROOT/kolab-16.0.1-107.tbits20190308.el7.x86_64/usr/share/doc/kolab-imap-16.0.1
[00:00:53] + exit 0
[00:00:53] Provides: kolab-imap = 16.0.1-107.tbits20190308.el7 kolab-imap(x86-64) = 16.0.1-107.tbits20190308.el7
[00:00:53] Requires(rpmlib): rpmlib(CompressedFileNames) <= 3.0.4-1 rpmlib(FileDigests) <= 4.6.0-1 rpmlib(PayloadFilesHavePrefix) <= 4.0-1
[00:00:53] Processing files: kolab-ldap-16.0.1-107.tbits20190308.el7.x86_64
[00:00:53] Executing(%doc): /bin/sh -e /var/tmp/rpm-tmp.ECp1LE
[00:00:53] + umask 022
[00:00:53] + cd /root/rpmbuild/BUILD
[00:00:53] + cd kolab-16.0.1
[00:00:53] + DOCDIR=/root/rpmbuild/BUILDROOT/kolab-16.0.1-107.tbits20190308.el7.x86_64/usr/share/doc/kolab-ldap-16.0.1
[00:00:53] + export DOCDIR
[00:00:53] + /usr/bin/mkdir -p /root/rpmbuild/BUILDROOT/kolab-16.0.1-107.tbits20190308.el7.x86_64/usr/share/doc/kolab-ldap-16.0.1
[00:00:53] + cp -pr README /root/rpmbuild/BUILDROOT/kolab-16.0.1-107.tbits20190308.el7.x86_64/usr/share/doc/kolab-ldap-16.0.1
[00:00:53] + exit 0
[00:00:53] Provides: kolab-ldap = 16.0.1-107.tbits20190308.el7 kolab-ldap(x86-64) = 16.0.1-107.tbits20190308.el7
[00:00:53] Requires(rpmlib): rpmlib(CompressedFileNames) <= 3.0.4-1 rpmlib(FileDigests) <= 4.6.0-1 rpmlib(PayloadFilesHavePrefix) <= 4.0-1
[00:00:53] Processing files: kolab-mta-16.0.1-107.tbits20190308.el7.x86_64
[00:00:53] Executing(%doc): /bin/sh -e /var/tmp/rpm-tmp.ksao8Y
[00:00:53] + umask 022
[00:00:53] + cd /root/rpmbuild/BUILD
[00:00:53] + cd kolab-16.0.1
[00:00:53] + DOCDIR=/root/rpmbuild/BUILDROOT/kolab-16.0.1-107.tbits20190308.el7.x86_64/usr/share/doc/kolab-mta-16.0.1
[00:00:53] + export DOCDIR
[00:00:53] + /usr/bin/mkdir -p /root/rpmbuild/BUILDROOT/kolab-16.0.1-107.tbits20190308.el7.x86_64/usr/share/doc/kolab-mta-16.0.1
[00:00:53] + cp -pr README /root/rpmbuild/BUILDROOT/kolab-16.0.1-107.tbits20190308.el7.x86_64/usr/share/doc/kolab-mta-16.0.1
[00:00:53] + exit 0
[00:00:53] Provides: kolab-mta = 16.0.1-107.tbits20190308.el7 kolab-mta(x86-64) = 16.0.1-107.tbits20190308.el7
[00:00:53] Requires(rpmlib): rpmlib(CompressedFileNames) <= 3.0.4-1 rpmlib(FileDigests) <= 4.6.0-1 rpmlib(PayloadFilesHavePrefix) <= 4.0-1
[00:00:53] Obsoletes: sendmail sendmail-cf
[00:00:53] Processing files: kolab-webclient-16.0.1-107.tbits20190308.el7.x86_64
[00:00:53] Executing(%doc): /bin/sh -e /var/tmp/rpm-tmp.msLXwj
[00:00:53] + umask 022
[00:00:53] + cd /root/rpmbuild/BUILD
[00:00:53] + cd kolab-16.0.1
[00:00:53] + DOCDIR=/root/rpmbuild/BUILDROOT/kolab-16.0.1-107.tbits20190308.el7.x86_64/usr/share/doc/kolab-webclient-16.0.1
[00:00:53] + export DOCDIR
[00:00:53] + /usr/bin/mkdir -p /root/rpmbuild/BUILDROOT/kolab-16.0.1-107.tbits20190308.el7.x86_64/usr/share/doc/kolab-webclient-16.0.1
[00:00:53] + cp -pr README /root/rpmbuild/BUILDROOT/kolab-16.0.1-107.tbits20190308.el7.x86_64/usr/share/doc/kolab-webclient-16.0.1
[00:00:53] + exit 0
[00:00:53] Provides: kolab-webclient = 16.0.1-107.tbits20190308.el7 kolab-webclient(x86-64) = 16.0.1-107.tbits20190308.el7
[00:00:53] Requires(rpmlib): rpmlib(CompressedFileNames) <= 3.0.4-1 rpmlib(FileDigests) <= 4.6.0-1 rpmlib(PayloadFilesHavePrefix) <= 4.0-1
[00:00:53] Checking for unpackaged file(s): /usr/lib/rpm/check-files /root/rpmbuild/BUILDROOT/kolab-16.0.1-107.tbits20190308.el7.x86_64
[00:00:53] Wrote: /root/rpmbuild/SRPMS/kolab-16.0.1-107.tbits20190308.el7.src.rpm
[00:00:53] Wrote: /root/rpmbuild/RPMS/x86_64/kolab-16.0.1-107.tbits20190308.el7.x86_64.rpm
[00:00:53] Wrote: /root/rpmbuild/RPMS/x86_64/kolab-conf-16.0.1-107.tbits20190308.el7.x86_64.rpm
[00:00:53] Wrote: /root/rpmbuild/RPMS/x86_64/kolab-imap-16.0.1-107.tbits20190308.el7.x86_64.rpm
[00:00:53] Wrote: /root/rpmbuild/RPMS/x86_64/kolab-ldap-16.0.1-107.tbits20190308.el7.x86_64.rpm
[00:00:53] Wrote: /root/rpmbuild/RPMS/x86_64/kolab-mta-16.0.1-107.tbits20190308.el7.x86_64.rpm
[00:00:53] Wrote: /root/rpmbuild/RPMS/x86_64/kolab-webclient-16.0.1-107.tbits20190308.el7.x86_64.rpm
[00:00:53] Executing(%clean): /bin/sh -e /var/tmp/rpm-tmp.HDloBX
[00:00:53] + umask 022
[00:00:53] + cd /root/rpmbuild/BUILD
[00:00:53] + cd kolab-16.0.1
[00:00:53] + exit 0
[00:00:54] 0
[00:00:54] now running: ssh -f -o "StrictHostKeyChecking no" -o Port=22 -i /etc/lightbuildserver/container/container_rsa root@10.0.3.5 "export LC_ALL=C; (mkdir -p ~/repo/src) 2>&1 && echo \$?"
[00:00:54] 0
[00:00:54] now running: ssh -f -o "StrictHostKeyChecking no" -o Port=22 -i /etc/lightbuildserver/container/container_rsa root@10.0.3.5 "export LC_ALL=C; (cp ~/rpmbuild/SRPMS/*.src.rpm ~/repo/src) 2>&1 && echo \$?"
[00:00:54] 0
[00:00:54] now running: ssh -f -o "StrictHostKeyChecking no" -o Port=22 -i /etc/lightbuildserver/container/container_rsa root@10.0.3.5 "export LC_ALL=C; (cp -R ~/rpmbuild/RPMS/* ~/repo) 2>&1 && echo \$?"
[00:00:54] 0
[00:00:54] now running: ssh -f -o "StrictHostKeyChecking no" -o Port=22 -i /etc/lightbuildserver/container/container_rsa root@10.0.3.5 "export LC_ALL=C; (cd repo && createrepo .) 2>&1 && echo \$?"
[00:00:55] Spawning worker 0 with 36 pkgs
[00:00:55] Spawning worker 1 with 35 pkgs
[00:00:55] Workers Finished
[00:00:55] Saving Primary metadata
[00:00:55] Saving file lists metadata
[00:00:55] Saving other metadata
[00:00:55] Generating sqlite DBs
[00:00:55] Sqlite DBs complete
[00:00:55] 0
[00:00:55] now running: rsync -avz --delete -e "ssh -i /etc/lightbuildserver/container/container_rsa -p 2222" root@build04lxc.lbs.solidcharity.com:/mnt/var/lib/lightbuildserver/repos/tbits.net/TBitsKolab16Dev/centos/7 /var/lib/lightbuildserver/repos/tbits.net/TBitsKolab16Dev/centos
[00:00:56] receiving incremental file list
[00:00:56] deleting 7/repodata/fb35862b417d9cf7fea522474071edc2f8c90ddf09f939366618e965a0332fff-other.xml.gz
[00:00:56] deleting 7/repodata/6b12e53d3aefdc0bca98985043061f04066b5e0f61fb312979686aaaf2507241-primary.sqlite.bz2
[00:00:56] deleting 7/repodata/4cdabc391854ef3fad8e545abf23e46939e9f4a6c396774d821bf9b1980c3cf3-other.sqlite.bz2
[00:00:56] deleting 7/repodata/413324d31b37ea7acf9277fc5f8e6fad076895f674bf771b7ae1f5cbbb94b2a5-filelists.xml.gz
[00:00:56] deleting 7/repodata/360e3fac9af66c2e04a9d1c05c43cbecf4c680a3ebb8a2a0469cf616721e3e0b-filelists.sqlite.bz2
[00:00:56] deleting 7/repodata/096c3c803cad6c1d79bb4bbcc58e3f302a242153ddd02582e3b5b0b2db597251-primary.xml.gz
[00:00:56] 7/
[00:00:56] 7/repodata/
[00:00:56] 7/repodata/32c4a917230aaf4a57c1582c40451d74a2f0b5ffa74578c40432510897b4a106-filelists.xml.gz
[00:00:56] 7/repodata/341b395987ca400cb8feb3a22c9457fbc7be7840558911f5dbbb98d784f1c858-filelists.sqlite.bz2
[00:00:56] 7/repodata/36016410f9188959e8b3b7c17e200d9cb81abc098c262a8bd01888d771d0c7d4-primary.xml.gz
[00:00:56] 7/repodata/3b7f9a1ffdda1062d50c5d351969c117de47ad729d63eb0a0118a1509585ddb5-other.xml.gz
[00:00:56] 7/repodata/5cb207dd827cc256bed353f102d294e0d57bf115b77d3c8a2bc0930d7166c832-primary.sqlite.bz2
[00:00:56] 7/repodata/83c664072549e46df69fc80af2e3066595dcc1ae1c929b43b1c6ab4f76583989-other.sqlite.bz2
[00:00:56] 7/repodata/repomd.xml
[00:00:56] 7/src/
[00:00:56] 7/src/kolab-16.0.1-107.tbits20190308.el7.src.rpm
[00:00:56] 7/x86_64/
[00:00:56] 7/x86_64/kolab-16.0.1-107.tbits20190308.el7.x86_64.rpm
[00:00:56] 7/x86_64/kolab-conf-16.0.1-107.tbits20190308.el7.x86_64.rpm
[00:00:56] 7/x86_64/kolab-imap-16.0.1-107.tbits20190308.el7.x86_64.rpm
[00:00:56] 7/x86_64/kolab-ldap-16.0.1-107.tbits20190308.el7.x86_64.rpm
[00:00:56] 7/x86_64/kolab-mta-16.0.1-107.tbits20190308.el7.x86_64.rpm
[00:00:56] 7/x86_64/kolab-webclient-16.0.1-107.tbits20190308.el7.x86_64.rpm
[00:00:56] 
[00:00:56] sent 349 bytes  received 218,098 bytes  436,894.00 bytes/sec
[00:00:56] total size is 45,198,685  speedup is 206.91
[00:00:57] now running: rsync -avz --delete -e "ssh -i /etc/lightbuildserver/container/container_rsa -p 2222" root@build04lxc.lbs.solidcharity.com:/mnt/var/lib/lightbuildserver/tarballs/tbits.net/TBitsKolab16Dev /var/lib/lightbuildserver/tarballs/tbits.net
[00:00:57] receiving incremental file list
[00:00:57] 
[00:00:57] sent 25 bytes  received 68 bytes  186.00 bytes/sec
[00:00:57] total size is 0  speedup is 0.00
[00:00:57] Success!
[00:01:09] This build took about 1 minutes

	
go to top of this page