Build Result for tbits.net/TBitsKolab16Test/pykolab/TBitsKolab16Test

go to bottom of this page
[00:00:00]  * Starting at 2019-01-07 22:22:23 GMT+0100
[00:00:00]  * Preparing the machine...
[00:00:01] now running: ssh -f -o "StrictHostKeyChecking no" -p 2222 -i /etc/lightbuildserver/container/container_rsa root@build04lxc.lbs.solidcharity.com "export LC_ALL=C; (if [ -d /var/lib/lxc/005-build04lxc.lbs.solidcharity.com ]; then lxc-destroy --name 005-build04lxc.lbs.solidcharity.com; fi) 2>&1; echo \$?"
[00:00:02] lxc-destroy: 005-build04lxc.lbs.solidcharity.com: tools/lxc_destroy.c: main: 271 Destroyed container 005-build04lxc.lbs.solidcharity.com
[00:00:02] 0
[00:00:02] now running: ssh -f -o "StrictHostKeyChecking no" -p 2222 -i /etc/lightbuildserver/container/container_rsa root@build04lxc.lbs.solidcharity.com "export LC_ALL=C; (/usr/share/lxc-scripts/initLXC.sh) 2>&1; echo \$?"
[00:00:03] patching file lxc-fedora
[00:00:03] Hunk #1 FAILED at 562.
[00:00:03] Hunk #2 FAILED at 570.
[00:00:03] Hunk #3 FAILED at 647.
[00:00:03] Hunk #4 FAILED at 680.
[00:00:03] Hunk #5 FAILED at 813.
[00:00:03] Hunk #6 succeeded at 1244 (offset 53 lines).
[00:00:03] 5 out of 6 hunks FAILED -- saving rejects to file lxc-fedora.rej
[00:00:03] patching file lxc-fedora
[00:00:03] Hunk #1 FAILED at 687.
[00:00:03] Hunk #2 FAILED at 695.
[00:00:03] Hunk #3 FAILED at 809.
[00:00:03] Hunk #4 FAILED at 1016.
[00:00:03] 4 out of 4 hunks FAILED -- saving rejects to file lxc-fedora.rej
[00:00:03] 0
[00:00:03] now running: ssh -f -o "StrictHostKeyChecking no" -p 2222 -i /etc/lightbuildserver/container/container_rsa root@build04lxc.lbs.solidcharity.com "export LC_ALL=C; (/usr/share/lxc-scripts/initCentOS.sh 005-build04lxc.lbs.solidcharity.com 5 7 amd64 0) 2>&1; echo \$?"
[00:00:04] Using image from local cache
[00:00:04] Unpacking the rootfs
[00:00:11] 
[00:00:11] ---
[00:00:11] You just created a CentOS container (release=7, arch=amd64, variant=default)
[00:00:11] 
[00:00:11] To enable sshd, run: yum install openssh-server
[00:00:11] 
[00:00:11] For security reason, container images ship without user accounts
[00:00:11] and without a root password.
[00:00:11] 
[00:00:11] Use lxc-attach or chroot directly into the rootfs to set a root password
[00:00:11] or create user accounts.
[00:00:11] Host 10.0.3.5 not found in /root/.ssh/known_hosts
[00:00:11] /root
[00:00:11] Loaded plugins: fastestmirror
[00:00:11] Determining fastest mirrors
[00:00:11]  * base: ftp.plusline.net
[00:00:11]  * extras: mirror.fra10.de.leaseweb.net
[00:00:11]  * updates: ftp.plusline.net
[00:00:14] Resolving Dependencies
[00:00:14] --> Running transaction check
[00:00:14] ---> Package openssh-server.x86_64 0:7.4p1-16.el7 will be installed
[00:00:14] --> Finished Dependency Resolution
[00:00:14] 
[00:00:14] Dependencies Resolved
[00:00:14] 
[00:00:14] ================================================================================
[00:00:14]  Package                Arch           Version               Repository    Size
[00:00:14] ================================================================================
[00:00:14] Installing:
[00:00:14]  openssh-server         x86_64         7.4p1-16.el7          base         458 k
[00:00:14] 
[00:00:14] Transaction Summary
[00:00:14] ================================================================================
[00:00:14] Install  1 Package
[00:00:14] 
[00:00:14] Total download size: 458 k
[00:00:14] Installed size: 971 k
[00:00:14] Downloading packages:
[00:00:14] warning: [fd 19]: Header V3 RSA/SHA256 Signature, key ID f4a80eb5: NOKEY
[00:00:14] Public key for openssh-server-7.4p1-16.el7.x86_64.rpm is not installed
[00:00:14] Retrieving key from file:///etc/pki/rpm-gpg/RPM-GPG-KEY-CentOS-7
[00:00:14] Importing GPG key 0xF4A80EB5:
[00:00:14]  Userid     : "CentOS-7 Key (CentOS 7 Official Signing Key) <security@centos.org>"
[00:00:14]  Fingerprint: 6341 ab27 53d7 8a78 a7c2 7bb1 24c6 a8a7 f4a8 0eb5
[00:00:14]  Package    : centos-release-7-6.1810.2.el7.centos.x86_64 (@base)
[00:00:14]  From       : /etc/pki/rpm-gpg/RPM-GPG-KEY-CentOS-7
[00:00:14] Running transaction check
[00:00:14] Running transaction test
[00:00:14] Transaction test succeeded
[00:00:14] Running transaction
[00:00:16]   Installing : openssh-server-7.4p1-16.el7.x86_64                           1/1 
[00:00:16]   Verifying  : openssh-server-7.4p1-16.el7.x86_64                           1/1 
[00:00:16] 
[00:00:16] Installed:
[00:00:16]   openssh-server.x86_64 0:7.4p1-16.el7                                          
[00:00:16] 
[00:00:16] Complete!
[00:00:16] Removing password for user root.
[00:00:16] passwd: Success
[00:00:16] To setup port forwarding from outside, please run:
[00:00:16] ./tunnelport.sh 5 22
[00:00:16] ./initWebproxy.sh 5 www.005-build04lxc.lbs.solidcharity.com.de
[00:00:16] 
[00:00:16] To start the container, run: lxc-start -d -n 005-build04lxc.lbs.solidcharity.com
[00:00:16] 
[00:00:16] To connect to the container locally, run: eval `ssh-agent`; ssh-add; ssh root@10.0.3.5
[00:00:16] 0
[00:00:16] now running: ssh -f -o "StrictHostKeyChecking no" -p 2222 -i /etc/lightbuildserver/container/container_rsa root@build04lxc.lbs.solidcharity.com "export LC_ALL=C; (/usr/share/lxc-scripts/tunnelport.sh 5 22) 2>&1; echo \$?"
[00:00:16] outward interface: ens18
[00:00:16] outward IP address: 80.241.214.124
[00:00:16] bridge interface: lxcbr0
[00:00:16] bridge address: 10.0.3.1
[00:00:16] guestip: 10.0.3.5
[00:00:16] there is already a mapping for port  2005
[00:00:16] 0
[00:00:16] now running: ssh -f -o "StrictHostKeyChecking no" -p 2222 -i /etc/lightbuildserver/container/container_rsa root@build04lxc.lbs.solidcharity.com "export LC_ALL=C; (mkdir -p /var/lib/lxc/005-build04lxc.lbs.solidcharity.com/rootfs/root/.ssh/) 2>&1; echo \$?"
[00:00:17] 0
[00:00:17] now running: echo "put /etc/lightbuildserver/container/container_rsa.pub authorized_keys2" | sftp -o "StrictHostKeyChecking no" -oPort=2222 -i /etc/lightbuildserver/container/container_rsa root@build04lxc.lbs.solidcharity.com:/var/lib/lxc/005-build04lxc.lbs.solidcharity.com/rootfs/root/.ssh/
[00:00:17] Connected to build04lxc.lbs.solidcharity.com.
[00:00:17] Changing to: /var/lib/lxc/005-build04lxc.lbs.solidcharity.com/rootfs/root/.ssh/
[00:00:17] sftp> put /etc/lightbuildserver/container/container_rsa.pub authorized_keys2
[00:00:17] Uploading /etc/lightbuildserver/container/container_rsa.pub to /var/lib/lxc/005-build04lxc.lbs.solidcharity.com/rootfs/root/.ssh/authorized_keys2
[00:00:17] now running: ssh -f -o "StrictHostKeyChecking no" -p 2222 -i /etc/lightbuildserver/container/container_rsa root@build04lxc.lbs.solidcharity.com "export LC_ALL=C; (cd /var/lib/lxc/005-build04lxc.lbs.solidcharity.com/rootfs/root/.ssh/ && cat authorized_keys2 >> authorized_keys && rm authorized_keys2) 2>&1; echo \$?"
[00:00:18] 0
[00:00:18] now running: ssh -f -o "StrictHostKeyChecking no" -p 2222 -i /etc/lightbuildserver/container/container_rsa root@build04lxc.lbs.solidcharity.com "export LC_ALL=C; (chmod 700 /var/lib/lxc/005-build04lxc.lbs.solidcharity.com/rootfs/root/.ssh/ && chmod 600 /var/lib/lxc/005-build04lxc.lbs.solidcharity.com/rootfs/root/.ssh/authorized_keys) 2>&1; echo \$?"
[00:00:18] 0
[00:00:18] now running: ssh -f -o "StrictHostKeyChecking no" -p 2222 -i /etc/lightbuildserver/container/container_rsa root@build04lxc.lbs.solidcharity.com "export LC_ALL=C; (/usr/share/lxc-scripts/initMount.sh /mnt/var/lib/lightbuildserver/repos/tbits.net/TBitsKolab16Test/centos/7 005-build04lxc.lbs.solidcharity.com /root/repo) 2>&1; echo \$?"
[00:00:18] 0
[00:00:18] now running: rsync -avz --delete -e "ssh -i /etc/lightbuildserver/container/container_rsa -p 2222" /var/lib/lightbuildserver/repos/tbits.net/TBitsKolab16Test/centos/7 root@build04lxc.lbs.solidcharity.com:/mnt/var/lib/lightbuildserver/repos/tbits.net/TBitsKolab16Test/centos
[00:00:19] sending incremental file list
[00:00:19] 7/lbs-tbits.net-TBitsKolab16Test.repo
[00:00:19] 7/repodata/
[00:00:19] 
[00:00:19] sent 4,096 bytes  received 80 bytes  8,352.00 bytes/sec
[00:00:19] total size is 43,867,103  speedup is 10,504.57
[00:00:19] now running: ssh -f -o "StrictHostKeyChecking no" -p 2222 -i /etc/lightbuildserver/container/container_rsa root@build04lxc.lbs.solidcharity.com "export LC_ALL=C; (/usr/share/lxc-scripts/initMount.sh /mnt/var/lib/lightbuildserver/tarballs/tbits.net/TBitsKolab16Test 005-build04lxc.lbs.solidcharity.com /root/tarball) 2>&1; echo \$?"
[00:00:19] 0
[00:00:19] now running: rsync -avz --delete -e "ssh -i /etc/lightbuildserver/container/container_rsa -p 2222" /var/lib/lightbuildserver/tarballs/tbits.net/TBitsKolab16Test root@build04lxc.lbs.solidcharity.com:/mnt/var/lib/lightbuildserver/tarballs/tbits.net
[00:00:19] sending incremental file list
[00:00:19] 
[00:00:19] sent 84 bytes  received 17 bytes  202.00 bytes/sec
[00:00:19] total size is 0  speedup is 0.00
[00:00:20] now running: ssh -f -o "StrictHostKeyChecking no" -p 2222 -i /etc/lightbuildserver/container/container_rsa root@build04lxc.lbs.solidcharity.com "export LC_ALL=C; (lxc-start -d -n 005-build04lxc.lbs.solidcharity.com) 2>&1; echo \$?"
[00:00:20] 0
[00:00:20] now running: ssh-keygen -f "/run/uwsgi/.ssh/known_hosts" -R 10.0.3.5
[00:00:20] # Host 10.0.3.5 found: line 7
[00:00:20] /run/uwsgi/.ssh/known_hosts updated.
[00:00:20] Original contents retained as /run/uwsgi/.ssh/known_hosts.old
[00:00:20] now running: ssh -f -o "StrictHostKeyChecking no" -o Port=22 -i /etc/lightbuildserver/container/container_rsa root@10.0.3.5 "export LC_ALL=C; (echo "container is running") 2>&1 && echo \$?"
[00:00:21] Warning: Permanently added '10.0.3.5' (ECDSA) to the list of known hosts.
[00:00:21] container is running
[00:00:21] 0
[00:00:21] container has been started successfully
[00:00:21] now running: ssh -f -o "StrictHostKeyChecking no" -o Port=22 -i /etc/lightbuildserver/container/container_rsa root@10.0.3.5 "export LC_ALL=C; (yum -y install tar createrepo gcc rpm-build rpm-sign gnupg make curl iptables rsync perl iproute yum-utils yum-plugin-priorities) 2>&1 && echo \$?"
[00:00:22] Loaded plugins: fastestmirror
[00:00:22] Loading mirror speeds from cached hostfile
[00:00:22]  * base: centos.copahost.com
[00:00:22]  * extras: mirror.ratiokontakt.de
[00:00:22]  * updates: ftp.plusline.net
[00:00:22] Package 2:tar-1.26-35.el7.x86_64 already installed and latest version
[00:00:22] Package gnupg2-2.0.22-5.el7_5.x86_64 already installed and latest version
[00:00:22] Package curl-7.29.0-51.el7.x86_64 already installed and latest version
[00:00:22] Package iptables-1.4.21-28.el7.x86_64 already installed and latest version
[00:00:22] Package iproute-4.11.0-14.el7.x86_64 already installed and latest version
[00:00:22] Resolving Dependencies
[00:00:22] --> Running transaction check
[00:00:22] ---> Package createrepo.noarch 0:0.9.9-28.el7 will be installed
[00:00:22] --> Processing Dependency: python-deltarpm for package: createrepo-0.9.9-28.el7.noarch
[00:00:22] --> Processing Dependency: libxml2-python for package: createrepo-0.9.9-28.el7.noarch
[00:00:22] --> Processing Dependency: deltarpm for package: createrepo-0.9.9-28.el7.noarch
[00:00:22] ---> Package gcc.x86_64 0:4.8.5-36.el7 will be installed
[00:00:22] --> Processing Dependency: libgomp = 4.8.5-36.el7 for package: gcc-4.8.5-36.el7.x86_64
[00:00:22] --> Processing Dependency: cpp = 4.8.5-36.el7 for package: gcc-4.8.5-36.el7.x86_64
[00:00:22] --> Processing Dependency: glibc-devel >= 2.2.90-12 for package: gcc-4.8.5-36.el7.x86_64
[00:00:22] --> Processing Dependency: libmpfr.so.4()(64bit) for package: gcc-4.8.5-36.el7.x86_64
[00:00:22] --> Processing Dependency: libmpc.so.3()(64bit) for package: gcc-4.8.5-36.el7.x86_64
[00:00:22] --> Processing Dependency: libgomp.so.1()(64bit) for package: gcc-4.8.5-36.el7.x86_64
[00:00:22] ---> Package make.x86_64 1:3.82-23.el7 will be installed
[00:00:22] ---> Package perl.x86_64 4:5.16.3-293.el7 will be installed
[00:00:22] --> Processing Dependency: perl-libs = 4:5.16.3-293.el7 for package: 4:perl-5.16.3-293.el7.x86_64
[00:00:22] --> Processing Dependency: perl(Socket) >= 1.3 for package: 4:perl-5.16.3-293.el7.x86_64
[00:00:22] --> Processing Dependency: perl(Scalar::Util) >= 1.10 for package: 4:perl-5.16.3-293.el7.x86_64
[00:00:22] --> Processing Dependency: perl-macros for package: 4:perl-5.16.3-293.el7.x86_64
[00:00:22] --> Processing Dependency: perl-libs for package: 4:perl-5.16.3-293.el7.x86_64
[00:00:22] --> Processing Dependency: perl(threads::shared) for package: 4:perl-5.16.3-293.el7.x86_64
[00:00:22] --> Processing Dependency: perl(threads) for package: 4:perl-5.16.3-293.el7.x86_64
[00:00:22] --> Processing Dependency: perl(constant) for package: 4:perl-5.16.3-293.el7.x86_64
[00:00:22] --> Processing Dependency: perl(Time::Local) for package: 4:perl-5.16.3-293.el7.x86_64
[00:00:22] --> Processing Dependency: perl(Time::HiRes) for package: 4:perl-5.16.3-293.el7.x86_64
[00:00:22] --> Processing Dependency: perl(Storable) for package: 4:perl-5.16.3-293.el7.x86_64
[00:00:22] --> Processing Dependency: perl(Socket) for package: 4:perl-5.16.3-293.el7.x86_64
[00:00:22] --> Processing Dependency: perl(Scalar::Util) for package: 4:perl-5.16.3-293.el7.x86_64
[00:00:22] --> Processing Dependency: perl(Pod::Simple::XHTML) for package: 4:perl-5.16.3-293.el7.x86_64
[00:00:22] --> Processing Dependency: perl(Pod::Simple::Search) for package: 4:perl-5.16.3-293.el7.x86_64
[00:00:22] --> Processing Dependency: perl(Getopt::Long) for package: 4:perl-5.16.3-293.el7.x86_64
[00:00:22] --> Processing Dependency: perl(Filter::Util::Call) for package: 4:perl-5.16.3-293.el7.x86_64
[00:00:22] --> Processing Dependency: perl(File::Temp) for package: 4:perl-5.16.3-293.el7.x86_64
[00:00:22] --> Processing Dependency: perl(File::Spec::Unix) for package: 4:perl-5.16.3-293.el7.x86_64
[00:00:22] --> Processing Dependency: perl(File::Spec::Functions) for package: 4:perl-5.16.3-293.el7.x86_64
[00:00:22] --> Processing Dependency: perl(File::Spec) for package: 4:perl-5.16.3-293.el7.x86_64
[00:00:22] --> Processing Dependency: perl(File::Path) for package: 4:perl-5.16.3-293.el7.x86_64
[00:00:22] --> Processing Dependency: perl(Exporter) for package: 4:perl-5.16.3-293.el7.x86_64
[00:00:22] --> Processing Dependency: perl(Cwd) for package: 4:perl-5.16.3-293.el7.x86_64
[00:00:22] --> Processing Dependency: perl(Carp) for package: 4:perl-5.16.3-293.el7.x86_64
[00:00:22] --> Processing Dependency: libperl.so()(64bit) for package: 4:perl-5.16.3-293.el7.x86_64
[00:00:22] ---> Package rpm-build.x86_64 0:4.11.3-35.el7 will be installed
[00:00:22] --> Processing Dependency: patch >= 2.5 for package: rpm-build-4.11.3-35.el7.x86_64
[00:00:22] --> Processing Dependency: elfutils >= 0.128 for package: rpm-build-4.11.3-35.el7.x86_64
[00:00:22] --> Processing Dependency: unzip for package: rpm-build-4.11.3-35.el7.x86_64
[00:00:22] --> Processing Dependency: system-rpm-config for package: rpm-build-4.11.3-35.el7.x86_64
[00:00:22] --> Processing Dependency: perl(Thread::Queue) for package: rpm-build-4.11.3-35.el7.x86_64
[00:00:22] --> Processing Dependency: file for package: rpm-build-4.11.3-35.el7.x86_64
[00:00:22] --> Processing Dependency: bzip2 for package: rpm-build-4.11.3-35.el7.x86_64
[00:00:22] --> Processing Dependency: /usr/bin/gdb-add-index for package: rpm-build-4.11.3-35.el7.x86_64
[00:00:22] ---> Package rpm-sign.x86_64 0:4.11.3-35.el7 will be installed
[00:00:22] ---> Package rsync.x86_64 0:3.1.2-4.el7 will be installed
[00:00:22] ---> Package yum-plugin-priorities.noarch 0:1.1.31-50.el7 will be installed
[00:00:22] ---> Package yum-utils.noarch 0:1.1.31-50.el7 will be installed
[00:00:22] --> Processing Dependency: python-kitchen for package: yum-utils-1.1.31-50.el7.noarch
[00:00:22] --> Running transaction check
[00:00:22] ---> Package bzip2.x86_64 0:1.0.6-13.el7 will be installed
[00:00:22] ---> Package cpp.x86_64 0:4.8.5-36.el7 will be installed
[00:00:22] ---> Package deltarpm.x86_64 0:3.6-3.el7 will be installed
[00:00:22] ---> Package elfutils.x86_64 0:0.172-2.el7 will be installed
[00:00:23] ---> Package file.x86_64 0:5.11-35.el7 will be installed
[00:00:23] ---> Package gdb.x86_64 0:7.6.1-114.el7 will be installed
[00:00:23] ---> Package glibc-devel.x86_64 0:2.17-260.el7 will be installed
[00:00:23] --> Processing Dependency: glibc-headers = 2.17-260.el7 for package: glibc-devel-2.17-260.el7.x86_64
[00:00:23] --> Processing Dependency: glibc-headers for package: glibc-devel-2.17-260.el7.x86_64
[00:00:23] ---> Package libgomp.x86_64 0:4.8.5-36.el7 will be installed
[00:00:23] ---> Package libmpc.x86_64 0:1.0.1-3.el7 will be installed
[00:00:23] ---> Package libxml2-python.x86_64 0:2.9.1-6.el7_2.3 will be installed
[00:00:23] ---> Package mpfr.x86_64 0:3.1.1-4.el7 will be installed
[00:00:23] ---> Package patch.x86_64 0:2.7.1-10.el7_5 will be installed
[00:00:23] ---> Package perl-Carp.noarch 0:1.26-244.el7 will be installed
[00:00:23] ---> Package perl-Exporter.noarch 0:5.68-3.el7 will be installed
[00:00:23] ---> Package perl-File-Path.noarch 0:2.09-2.el7 will be installed
[00:00:23] ---> Package perl-File-Temp.noarch 0:0.23.01-3.el7 will be installed
[00:00:23] ---> Package perl-Filter.x86_64 0:1.49-3.el7 will be installed
[00:00:23] ---> Package perl-Getopt-Long.noarch 0:2.40-3.el7 will be installed
[00:00:23] --> Processing Dependency: perl(Pod::Usage) >= 1.14 for package: perl-Getopt-Long-2.40-3.el7.noarch
[00:00:23] --> Processing Dependency: perl(Text::ParseWords) for package: perl-Getopt-Long-2.40-3.el7.noarch
[00:00:23] ---> Package perl-PathTools.x86_64 0:3.40-5.el7 will be installed
[00:00:23] ---> Package perl-Pod-Simple.noarch 1:3.28-4.el7 will be installed
[00:00:23] --> Processing Dependency: perl(Pod::Escapes) >= 1.04 for package: 1:perl-Pod-Simple-3.28-4.el7.noarch
[00:00:23] --> Processing Dependency: perl(Encode) for package: 1:perl-Pod-Simple-3.28-4.el7.noarch
[00:00:23] ---> Package perl-Scalar-List-Utils.x86_64 0:1.27-248.el7 will be installed
[00:00:23] ---> Package perl-Socket.x86_64 0:2.010-4.el7 will be installed
[00:00:23] ---> Package perl-Storable.x86_64 0:2.45-3.el7 will be installed
[00:00:23] ---> Package perl-Thread-Queue.noarch 0:3.02-2.el7 will be installed
[00:00:23] ---> Package perl-Time-HiRes.x86_64 4:1.9725-3.el7 will be installed
[00:00:23] ---> Package perl-Time-Local.noarch 0:1.2300-2.el7 will be installed
[00:00:23] ---> Package perl-constant.noarch 0:1.27-2.el7 will be installed
[00:00:23] ---> Package perl-libs.x86_64 4:5.16.3-293.el7 will be installed
[00:00:23] ---> Package perl-macros.x86_64 4:5.16.3-293.el7 will be installed
[00:00:23] ---> Package perl-threads.x86_64 0:1.87-4.el7 will be installed
[00:00:23] ---> Package perl-threads-shared.x86_64 0:1.43-6.el7 will be installed
[00:00:23] ---> Package python-deltarpm.x86_64 0:3.6-3.el7 will be installed
[00:00:23] ---> Package python-kitchen.noarch 0:1.1.1-5.el7 will be installed
[00:00:23] --> Processing Dependency: python-chardet for package: python-kitchen-1.1.1-5.el7.noarch
[00:00:23] ---> Package redhat-rpm-config.noarch 0:9.1.0-87.el7.centos will be installed
[00:00:23] --> Processing Dependency: dwz >= 0.4 for package: redhat-rpm-config-9.1.0-87.el7.centos.noarch
[00:00:23] --> Processing Dependency: zip for package: redhat-rpm-config-9.1.0-87.el7.centos.noarch
[00:00:23] --> Processing Dependency: perl-srpm-macros for package: redhat-rpm-config-9.1.0-87.el7.centos.noarch
[00:00:23] ---> Package unzip.x86_64 0:6.0-19.el7 will be installed
[00:00:23] --> Running transaction check
[00:00:23] ---> Package dwz.x86_64 0:0.11-3.el7 will be installed
[00:00:23] ---> Package glibc-headers.x86_64 0:2.17-260.el7 will be installed
[00:00:23] --> Processing Dependency: kernel-headers >= 2.2.1 for package: glibc-headers-2.17-260.el7.x86_64
[00:00:23] --> Processing Dependency: kernel-headers for package: glibc-headers-2.17-260.el7.x86_64
[00:00:23] ---> Package perl-Encode.x86_64 0:2.51-7.el7 will be installed
[00:00:23] ---> Package perl-Pod-Escapes.noarch 1:1.04-293.el7 will be installed
[00:00:23] ---> Package perl-Pod-Usage.noarch 0:1.63-3.el7 will be installed
[00:00:23] --> Processing Dependency: perl(Pod::Text) >= 3.15 for package: perl-Pod-Usage-1.63-3.el7.noarch
[00:00:23] --> Processing Dependency: perl-Pod-Perldoc for package: perl-Pod-Usage-1.63-3.el7.noarch
[00:00:23] ---> Package perl-Text-ParseWords.noarch 0:3.29-4.el7 will be installed
[00:00:23] ---> Package perl-srpm-macros.noarch 0:1-8.el7 will be installed
[00:00:23] ---> Package python-chardet.noarch 0:2.2.1-1.el7_1 will be installed
[00:00:23] ---> Package zip.x86_64 0:3.0-11.el7 will be installed
[00:00:23] --> Running transaction check
[00:00:23] ---> Package kernel-headers.x86_64 0:3.10.0-957.1.3.el7 will be installed
[00:00:23] ---> Package perl-Pod-Perldoc.noarch 0:3.20-4.el7 will be installed
[00:00:23] --> Processing Dependency: perl(parent) for package: perl-Pod-Perldoc-3.20-4.el7.noarch
[00:00:23] --> Processing Dependency: perl(HTTP::Tiny) for package: perl-Pod-Perldoc-3.20-4.el7.noarch
[00:00:23] --> Processing Dependency: groff-base for package: perl-Pod-Perldoc-3.20-4.el7.noarch
[00:00:23] ---> Package perl-podlators.noarch 0:2.5.1-3.el7 will be installed
[00:00:23] --> Running transaction check
[00:00:23] ---> Package groff-base.x86_64 0:1.22.2-8.el7 will be installed
[00:00:23] ---> Package perl-HTTP-Tiny.noarch 0:0.033-3.el7 will be installed
[00:00:23] ---> Package perl-parent.noarch 1:0.225-244.el7 will be installed
[00:00:23] --> Finished Dependency Resolution
[00:00:23] 
[00:00:23] Dependencies Resolved
[00:00:23] 
[00:00:23] ================================================================================
[00:00:23]  Package                   Arch      Version                   Repository  Size
[00:00:23] ================================================================================
[00:00:23] Installing:
[00:00:23]  createrepo                noarch    0.9.9-28.el7              base        94 k
[00:00:23]  gcc                       x86_64    4.8.5-36.el7              base        16 M
[00:00:23]  make                      x86_64    1:3.82-23.el7             base       420 k
[00:00:23]  perl                      x86_64    4:5.16.3-293.el7          base       8.0 M
[00:00:23]  rpm-build                 x86_64    4.11.3-35.el7             base       147 k
[00:00:23]  rpm-sign                  x86_64    4.11.3-35.el7             base        48 k
[00:00:23]  rsync                     x86_64    3.1.2-4.el7               base       403 k
[00:00:23]  yum-plugin-priorities     noarch    1.1.31-50.el7             base        29 k
[00:00:23]  yum-utils                 noarch    1.1.31-50.el7             base       121 k
[00:00:23] Installing for dependencies:
[00:00:23]  bzip2                     x86_64    1.0.6-13.el7              base        52 k
[00:00:23]  cpp                       x86_64    4.8.5-36.el7              base       5.9 M
[00:00:23]  deltarpm                  x86_64    3.6-3.el7                 base        82 k
[00:00:23]  dwz                       x86_64    0.11-3.el7                base        99 k
[00:00:23]  elfutils                  x86_64    0.172-2.el7               base       299 k
[00:00:23]  file                      x86_64    5.11-35.el7               base        57 k
[00:00:23]  gdb                       x86_64    7.6.1-114.el7             base       2.4 M
[00:00:23]  glibc-devel               x86_64    2.17-260.el7              base       1.1 M
[00:00:23]  glibc-headers             x86_64    2.17-260.el7              base       683 k
[00:00:23]  groff-base                x86_64    1.22.2-8.el7              base       942 k
[00:00:23]  kernel-headers            x86_64    3.10.0-957.1.3.el7        updates    8.0 M
[00:00:23]  libgomp                   x86_64    4.8.5-36.el7              base       157 k
[00:00:23]  libmpc                    x86_64    1.0.1-3.el7               base        51 k
[00:00:23]  libxml2-python            x86_64    2.9.1-6.el7_2.3           base       247 k
[00:00:23]  mpfr                      x86_64    3.1.1-4.el7               base       203 k
[00:00:23]  patch                     x86_64    2.7.1-10.el7_5            base       110 k
[00:00:23]  perl-Carp                 noarch    1.26-244.el7              base        19 k
[00:00:23]  perl-Encode               x86_64    2.51-7.el7                base       1.5 M
[00:00:23]  perl-Exporter             noarch    5.68-3.el7                base        28 k
[00:00:23]  perl-File-Path            noarch    2.09-2.el7                base        26 k
[00:00:23]  perl-File-Temp            noarch    0.23.01-3.el7             base        56 k
[00:00:23]  perl-Filter               x86_64    1.49-3.el7                base        76 k
[00:00:23]  perl-Getopt-Long          noarch    2.40-3.el7                base        56 k
[00:00:23]  perl-HTTP-Tiny            noarch    0.033-3.el7               base        38 k
[00:00:23]  perl-PathTools            x86_64    3.40-5.el7                base        82 k
[00:00:23]  perl-Pod-Escapes          noarch    1:1.04-293.el7            base        51 k
[00:00:23]  perl-Pod-Perldoc          noarch    3.20-4.el7                base        87 k
[00:00:23]  perl-Pod-Simple           noarch    1:3.28-4.el7              base       216 k
[00:00:23]  perl-Pod-Usage            noarch    1.63-3.el7                base        27 k
[00:00:23]  perl-Scalar-List-Utils    x86_64    1.27-248.el7              base        36 k
[00:00:23]  perl-Socket               x86_64    2.010-4.el7               base        49 k
[00:00:23]  perl-Storable             x86_64    2.45-3.el7                base        77 k
[00:00:23]  perl-Text-ParseWords      noarch    3.29-4.el7                base        14 k
[00:00:23]  perl-Thread-Queue         noarch    3.02-2.el7                base        17 k
[00:00:23]  perl-Time-HiRes           x86_64    4:1.9725-3.el7            base        45 k
[00:00:23]  perl-Time-Local           noarch    1.2300-2.el7              base        24 k
[00:00:23]  perl-constant             noarch    1.27-2.el7                base        19 k
[00:00:23]  perl-libs                 x86_64    4:5.16.3-293.el7          base       688 k
[00:00:23]  perl-macros               x86_64    4:5.16.3-293.el7          base        44 k
[00:00:23]  perl-parent               noarch    1:0.225-244.el7           base        12 k
[00:00:23]  perl-podlators            noarch    2.5.1-3.el7               base       112 k
[00:00:23]  perl-srpm-macros          noarch    1-8.el7                   base       4.6 k
[00:00:23]  perl-threads              x86_64    1.87-4.el7                base        49 k
[00:00:23]  perl-threads-shared       x86_64    1.43-6.el7                base        39 k
[00:00:23]  python-chardet            noarch    2.2.1-1.el7_1             base       227 k
[00:00:23]  python-deltarpm           x86_64    3.6-3.el7                 base        31 k
[00:00:23]  python-kitchen            noarch    1.1.1-5.el7               base       267 k
[00:00:23]  redhat-rpm-config         noarch    9.1.0-87.el7.centos       base        81 k
[00:00:23]  unzip                     x86_64    6.0-19.el7                base       170 k
[00:00:23]  zip                       x86_64    3.0-11.el7                base       260 k
[00:00:23] 
[00:00:23] Transaction Summary
[00:00:23] ================================================================================
[00:00:23] Install  9 Packages (+50 Dependent packages)
[00:00:23] 
[00:00:23] Total size: 50 M
[00:00:23] Installed size: 116 M
[00:00:23] Downloading packages:
[00:00:23] Running transaction check
[00:00:23] Running transaction test
[00:00:23] Transaction test succeeded
[00:00:23] Running transaction
[00:00:24]   Installing : mpfr-3.1.1-4.el7.x86_64                                     1/59 
[00:00:24]   Installing : libmpc-1.0.1-3.el7.x86_64                                   2/59 
[00:00:24]   Installing : deltarpm-3.6-3.el7.x86_64                                   3/59 
[00:00:24]   Installing : libxml2-python-2.9.1-6.el7_2.3.x86_64                       4/59 
[00:00:24]   Installing : python-deltarpm-3.6-3.el7.x86_64                            5/59 
[00:00:24]   Installing : cpp-4.8.5-36.el7.x86_64                                     6/59 
[00:00:24]   Installing : elfutils-0.172-2.el7.x86_64                                 7/59 
[00:00:25]   Installing : patch-2.7.1-10.el7_5.x86_64                                 8/59 
[00:00:25]   Installing : unzip-6.0-19.el7.x86_64                                     9/59 
[00:00:25]   Installing : python-chardet-2.2.1-1.el7_1.noarch                        10/59 
[00:00:25]   Installing : python-kitchen-1.1.1-5.el7.noarch                          11/59 
[00:00:25]   Installing : zip-3.0-11.el7.x86_64                                      12/59 
[00:00:25]   Installing : kernel-headers-3.10.0-957.1.3.el7.x86_64                   13/59 
[00:00:25]   Installing : glibc-headers-2.17-260.el7.x86_64                          14/59 
[00:00:26]   Installing : glibc-devel-2.17-260.el7.x86_64                            15/59 
[00:00:26]   Installing : libgomp-4.8.5-36.el7.x86_64                                16/59 
[00:00:26]   Installing : file-5.11-35.el7.x86_64                                    17/59 
[00:00:26]   Installing : perl-srpm-macros-1-8.el7.noarch                            18/59 
[00:00:26]   Installing : gdb-7.6.1-114.el7.x86_64                                   19/59 
[00:00:26]   Installing : dwz-0.11-3.el7.x86_64                                      20/59 
[00:00:26]   Installing : groff-base-1.22.2-8.el7.x86_64                             21/59 
[00:00:26]   Installing : 1:perl-parent-0.225-244.el7.noarch                         22/59 
[00:00:26]   Installing : perl-HTTP-Tiny-0.033-3.el7.noarch                          23/59 
[00:00:26]   Installing : perl-podlators-2.5.1-3.el7.noarch                          24/59 
[00:00:26]   Installing : perl-Pod-Perldoc-3.20-4.el7.noarch                         25/59 
[00:00:26]   Installing : 1:perl-Pod-Escapes-1.04-293.el7.noarch                     26/59 
[00:00:27]   Installing : perl-Text-ParseWords-3.29-4.el7.noarch                     27/59 
[00:00:27]   Installing : perl-Encode-2.51-7.el7.x86_64                              28/59 
[00:00:27]   Installing : perl-Pod-Usage-1.63-3.el7.noarch                           29/59 
[00:00:27]   Installing : perl-threads-1.87-4.el7.x86_64                             30/59 
[00:00:27]   Installing : 4:perl-Time-HiRes-1.9725-3.el7.x86_64                      31/59 
[00:00:27]   Installing : perl-Exporter-5.68-3.el7.noarch                            32/59 
[00:00:27]   Installing : perl-constant-1.27-2.el7.noarch                            33/59 
[00:00:27]   Installing : perl-Carp-1.26-244.el7.noarch                              34/59 
[00:00:27]   Installing : 4:perl-macros-5.16.3-293.el7.x86_64                        35/59 
[00:00:27]   Installing : perl-Time-Local-1.2300-2.el7.noarch                        36/59 
[00:00:27]   Installing : perl-Socket-2.010-4.el7.x86_64                             37/59 
[00:00:27]   Installing : perl-Storable-2.45-3.el7.x86_64                            38/59 
[00:00:27]   Installing : perl-threads-shared-1.43-6.el7.x86_64                      39/59 
[00:00:27]   Installing : perl-PathTools-3.40-5.el7.x86_64                           40/59 
[00:00:27]   Installing : perl-Scalar-List-Utils-1.27-248.el7.x86_64                 41/59 
[00:00:27]   Installing : 1:perl-Pod-Simple-3.28-4.el7.noarch                        42/59 
[00:00:27]   Installing : perl-File-Temp-0.23.01-3.el7.noarch                        43/59 
[00:00:27]   Installing : perl-File-Path-2.09-2.el7.noarch                           44/59 
[00:00:27]   Installing : perl-Filter-1.49-3.el7.x86_64                              45/59 
[00:00:27]   Installing : 4:perl-libs-5.16.3-293.el7.x86_64                          46/59 
[00:00:28]   Installing : perl-Getopt-Long-2.40-3.el7.noarch                         47/59 
[00:00:28]   Installing : 4:perl-5.16.3-293.el7.x86_64                               48/59 
[00:00:28]   Installing : perl-Thread-Queue-3.02-2.el7.noarch                        49/59 
[00:00:28]   Installing : redhat-rpm-config-9.1.0-87.el7.centos.noarch               50/59 
[00:00:28]   Installing : bzip2-1.0.6-13.el7.x86_64                                  51/59 
[00:00:30]   Installing : rpm-build-4.11.3-35.el7.x86_64                             52/59 
[00:00:30]   Installing : gcc-4.8.5-36.el7.x86_64                                    53/59 
[00:00:30]   Installing : yum-utils-1.1.31-50.el7.noarch                             54/59 
[00:00:30]   Installing : createrepo-0.9.9-28.el7.noarch                             55/59 
[00:00:30]   Installing : rsync-3.1.2-4.el7.x86_64                                   56/59 
[00:00:30]   Installing : 1:make-3.82-23.el7.x86_64                                  57/59 
[00:00:30]   Installing : rpm-sign-4.11.3-35.el7.x86_64                              58/59 
[00:00:30]   Installing : yum-plugin-priorities-1.1.31-50.el7.noarch                 59/59 
[00:00:30]   Verifying  : perl-HTTP-Tiny-0.033-3.el7.noarch                           1/59 
[00:00:30]   Verifying  : rpm-build-4.11.3-35.el7.x86_64                              2/59 
[00:00:30]   Verifying  : perl-threads-shared-1.43-6.el7.x86_64                       3/59 
[00:00:30]   Verifying  : 4:perl-Time-HiRes-1.9725-3.el7.x86_64                       4/59 
[00:00:30]   Verifying  : perl-Pod-Perldoc-3.20-4.el7.noarch                          5/59 
[00:00:30]   Verifying  : perl-threads-1.87-4.el7.x86_64                              6/59 
[00:00:30]   Verifying  : perl-Exporter-5.68-3.el7.noarch                             7/59 
[00:00:30]   Verifying  : perl-constant-1.27-2.el7.noarch                             8/59 
[00:00:30]   Verifying  : perl-PathTools-3.40-5.el7.x86_64                            9/59 
[00:00:30]   Verifying  : perl-Carp-1.26-244.el7.noarch                              10/59 
[00:00:30]   Verifying  : 4:perl-macros-5.16.3-293.el7.x86_64                        11/59 
[00:00:30]   Verifying  : 1:perl-parent-0.225-244.el7.noarch                         12/59 
[00:00:30]   Verifying  : bzip2-1.0.6-13.el7.x86_64                                  13/59 
[00:00:30]   Verifying  : gcc-4.8.5-36.el7.x86_64                                    14/59 
[00:00:30]   Verifying  : yum-plugin-priorities-1.1.31-50.el7.noarch                 15/59 
[00:00:30]   Verifying  : groff-base-1.22.2-8.el7.x86_64                             16/59 
[00:00:30]   Verifying  : perl-Thread-Queue-3.02-2.el7.noarch                        17/59 
[00:00:30]   Verifying  : perl-File-Temp-0.23.01-3.el7.noarch                        18/59 
[00:00:30]   Verifying  : 1:perl-Pod-Simple-3.28-4.el7.noarch                        19/59 
[00:00:30]   Verifying  : dwz-0.11-3.el7.x86_64                                      20/59 
[00:00:30]   Verifying  : perl-Time-Local-1.2300-2.el7.noarch                        21/59 
[00:00:30]   Verifying  : gdb-7.6.1-114.el7.x86_64                                   22/59 
[00:00:30]   Verifying  : 1:perl-Pod-Escapes-1.04-293.el7.noarch                     23/59 
[00:00:30]   Verifying  : perl-Text-ParseWords-3.29-4.el7.noarch                     24/59 
[00:00:30]   Verifying  : redhat-rpm-config-9.1.0-87.el7.centos.noarch               25/59 
[00:00:30]   Verifying  : perl-srpm-macros-1-8.el7.noarch                            26/59 
[00:00:30]   Verifying  : perl-Socket-2.010-4.el7.x86_64                             27/59 
[00:00:30]   Verifying  : rpm-sign-4.11.3-35.el7.x86_64                              28/59 
[00:00:30]   Verifying  : file-5.11-35.el7.x86_64                                    29/59 
[00:00:30]   Verifying  : cpp-4.8.5-36.el7.x86_64                                    30/59 
[00:00:30]   Verifying  : libgomp-4.8.5-36.el7.x86_64                                31/59 
[00:00:30]   Verifying  : perl-podlators-2.5.1-3.el7.noarch                          32/59 
[00:00:30]   Verifying  : libxml2-python-2.9.1-6.el7_2.3.x86_64                      33/59 
[00:00:30]   Verifying  : deltarpm-3.6-3.el7.x86_64                                  34/59 
[00:00:30]   Verifying  : perl-Storable-2.45-3.el7.x86_64                            35/59 
[00:00:30]   Verifying  : createrepo-0.9.9-28.el7.noarch                             36/59 
[00:00:30]   Verifying  : perl-Scalar-List-Utils-1.27-248.el7.x86_64                 37/59 
[00:00:30]   Verifying  : 1:make-3.82-23.el7.x86_64                                  38/59 
[00:00:30]   Verifying  : libmpc-1.0.1-3.el7.x86_64                                  39/59 
[00:00:30]   Verifying  : rsync-3.1.2-4.el7.x86_64                                   40/59 
[00:00:30]   Verifying  : kernel-headers-3.10.0-957.1.3.el7.x86_64                   41/59 
[00:00:30]   Verifying  : perl-Pod-Usage-1.63-3.el7.noarch                           42/59 
[00:00:30]   Verifying  : perl-Encode-2.51-7.el7.x86_64                              43/59 
[00:00:30]   Verifying  : glibc-devel-2.17-260.el7.x86_64                            44/59 
[00:00:30]   Verifying  : yum-utils-1.1.31-50.el7.noarch                             45/59 
[00:00:30]   Verifying  : python-deltarpm-3.6-3.el7.x86_64                           46/59 
[00:00:30]   Verifying  : 4:perl-5.16.3-293.el7.x86_64                               47/59 
[00:00:30]   Verifying  : perl-File-Path-2.09-2.el7.noarch                           48/59 
[00:00:30]   Verifying  : zip-3.0-11.el7.x86_64                                      49/59 
[00:00:30]   Verifying  : mpfr-3.1.1-4.el7.x86_64                                    50/59 
[00:00:30]   Verifying  : glibc-headers-2.17-260.el7.x86_64                          51/59 
[00:00:30]   Verifying  : python-chardet-2.2.1-1.el7_1.noarch                        52/59 
[00:00:30]   Verifying  : perl-Filter-1.49-3.el7.x86_64                              53/59 
[00:00:30]   Verifying  : perl-Getopt-Long-2.40-3.el7.noarch                         54/59 
[00:00:30]   Verifying  : python-kitchen-1.1.1-5.el7.noarch                          55/59 
[00:00:30]   Verifying  : unzip-6.0-19.el7.x86_64                                    56/59 
[00:00:30]   Verifying  : patch-2.7.1-10.el7_5.x86_64                                57/59 
[00:00:30]   Verifying  : 4:perl-libs-5.16.3-293.el7.x86_64                          58/59 
[00:00:30]   Verifying  : elfutils-0.172-2.el7.x86_64                                59/59 
[00:00:30] 
[00:00:30] Installed:
[00:00:30]   createrepo.noarch 0:0.9.9-28.el7 gcc.x86_64 0:4.8.5-36.el7                   
[00:00:30]   make.x86_64 1:3.82-23.el7        perl.x86_64 4:5.16.3-293.el7                
[00:00:30]   rpm-build.x86_64 0:4.11.3-35.el7 rpm-sign.x86_64 0:4.11.3-35.el7             
[00:00:30]   rsync.x86_64 0:3.1.2-4.el7       yum-plugin-priorities.noarch 0:1.1.31-50.el7
[00:00:30]   yum-utils.noarch 0:1.1.31-50.el7
[00:00:30] 
[00:00:30] Dependency Installed:
[00:00:30]   bzip2.x86_64 0:1.0.6-13.el7                                                   
[00:00:30]   cpp.x86_64 0:4.8.5-36.el7                                                     
[00:00:30]   deltarpm.x86_64 0:3.6-3.el7                                                   
[00:00:30]   dwz.x86_64 0:0.11-3.el7                                                       
[00:00:30]   elfutils.x86_64 0:0.172-2.el7                                                 
[00:00:30]   file.x86_64 0:5.11-35.el7                                                     
[00:00:30]   gdb.x86_64 0:7.6.1-114.el7                                                    
[00:00:30]   glibc-devel.x86_64 0:2.17-260.el7                                             
[00:00:30]   glibc-headers.x86_64 0:2.17-260.el7                                           
[00:00:30]   groff-base.x86_64 0:1.22.2-8.el7                                              
[00:00:30]   kernel-headers.x86_64 0:3.10.0-957.1.3.el7                                    
[00:00:30]   libgomp.x86_64 0:4.8.5-36.el7                                                 
[00:00:30]   libmpc.x86_64 0:1.0.1-3.el7                                                   
[00:00:30]   libxml2-python.x86_64 0:2.9.1-6.el7_2.3                                       
[00:00:30]   mpfr.x86_64 0:3.1.1-4.el7                                                     
[00:00:30]   patch.x86_64 0:2.7.1-10.el7_5                                                 
[00:00:30]   perl-Carp.noarch 0:1.26-244.el7                                               
[00:00:30]   perl-Encode.x86_64 0:2.51-7.el7                                               
[00:00:30]   perl-Exporter.noarch 0:5.68-3.el7                                             
[00:00:30]   perl-File-Path.noarch 0:2.09-2.el7                                            
[00:00:30]   perl-File-Temp.noarch 0:0.23.01-3.el7                                         
[00:00:30]   perl-Filter.x86_64 0:1.49-3.el7                                               
[00:00:30]   perl-Getopt-Long.noarch 0:2.40-3.el7                                          
[00:00:30]   perl-HTTP-Tiny.noarch 0:0.033-3.el7                                           
[00:00:30]   perl-PathTools.x86_64 0:3.40-5.el7                                            
[00:00:30]   perl-Pod-Escapes.noarch 1:1.04-293.el7                                        
[00:00:30]   perl-Pod-Perldoc.noarch 0:3.20-4.el7                                          
[00:00:30]   perl-Pod-Simple.noarch 1:3.28-4.el7                                           
[00:00:30]   perl-Pod-Usage.noarch 0:1.63-3.el7                                            
[00:00:30]   perl-Scalar-List-Utils.x86_64 0:1.27-248.el7                                  
[00:00:30]   perl-Socket.x86_64 0:2.010-4.el7                                              
[00:00:30]   perl-Storable.x86_64 0:2.45-3.el7                                             
[00:00:30]   perl-Text-ParseWords.noarch 0:3.29-4.el7                                      
[00:00:30]   perl-Thread-Queue.noarch 0:3.02-2.el7                                         
[00:00:30]   perl-Time-HiRes.x86_64 4:1.9725-3.el7                                         
[00:00:30]   perl-Time-Local.noarch 0:1.2300-2.el7                                         
[00:00:30]   perl-constant.noarch 0:1.27-2.el7                                             
[00:00:30]   perl-libs.x86_64 4:5.16.3-293.el7                                             
[00:00:30]   perl-macros.x86_64 4:5.16.3-293.el7                                           
[00:00:30]   perl-parent.noarch 1:0.225-244.el7                                            
[00:00:30]   perl-podlators.noarch 0:2.5.1-3.el7                                           
[00:00:30]   perl-srpm-macros.noarch 0:1-8.el7                                             
[00:00:30]   perl-threads.x86_64 0:1.87-4.el7                                              
[00:00:30]   perl-threads-shared.x86_64 0:1.43-6.el7                                       
[00:00:30]   python-chardet.noarch 0:2.2.1-1.el7_1                                         
[00:00:30]   python-deltarpm.x86_64 0:3.6-3.el7                                            
[00:00:30]   python-kitchen.noarch 0:1.1.1-5.el7                                           
[00:00:30]   redhat-rpm-config.noarch 0:9.1.0-87.el7.centos                                
[00:00:30]   unzip.x86_64 0:6.0-19.el7                                                     
[00:00:30]   zip.x86_64 0:3.0-11.el7                                                       
[00:00:30] 
[00:00:30] Complete!
[00:00:30] 0
[00:00:30] now running: ssh -f -o "StrictHostKeyChecking no" -o Port=22 -i /etc/lightbuildserver/container/container_rsa root@10.0.3.5 "export LC_ALL=C; (if [ -f /etc/yum.repos.d/CentOS-Sources.repo ]; then rm -Rf /etc/yum.repos.d/CentOS-Sources.repo; fi) 2>&1 && echo \$?"
[00:00:31] 0
[00:00:31] now running: ssh -f -o "StrictHostKeyChecking no" -o Port=22 -i /etc/lightbuildserver/container/container_rsa root@10.0.3.5 "export LC_ALL=C; (if [ -f /etc/yum.repos.d/CentOS-Vault.repo ]; then rm -Rf /etc/yum.repos.d/CentOS-Vault.repo; fi) 2>&1 && echo \$?"
[00:00:31] 0
[00:00:31] now running: ssh -f -o "StrictHostKeyChecking no" -o Port=22 -i /etc/lightbuildserver/container/container_rsa root@10.0.3.5 "export LC_ALL=C; (mkdir -p rpmbuild/{BUILD,RPMS,SOURCES,SPECS,SRPMS}) 2>&1 && echo \$?"
[00:00:31] 0
[00:00:31] now running: rsync -avz --delete -e "ssh -i /etc/lightbuildserver/container/container_rsa -p 2222" /var/lib/lightbuildserver/src/tbits.net/lbs-TBitsKolab16Test root@build04lxc.lbs.solidcharity.com:/var/lib/lxc/005-build04lxc.lbs.solidcharity.com/rootfs/root
[00:00:31] sending incremental file list
[00:00:31] lbs-TBitsKolab16Test/
[00:00:31] lbs-TBitsKolab16Test/Readme.md
[00:00:31] lbs-TBitsKolab16Test/config.yml
[00:00:31] lbs-TBitsKolab16Test/chwala/
[00:00:31] lbs-TBitsKolab16Test/chwala/chwala-0.2-suhosin.session.encrypt-php_flag.patch
[00:00:31] lbs-TBitsKolab16Test/chwala/chwala-0.5.2.tar.gz
[00:00:31] lbs-TBitsKolab16Test/chwala/chwala.logrotate
[00:00:31] lbs-TBitsKolab16Test/chwala/chwala.spec
[00:00:31] lbs-TBitsKolab16Test/chwala/fix-autoload-path-debian.patch
[00:00:31] lbs-TBitsKolab16Test/cyrus-imapd/
[00:00:31] lbs-TBitsKolab16Test/cyrus-imapd/0001-dlist-Use-int8_t-in-dlist_parsemap.patch
[00:00:31] lbs-TBitsKolab16Test/cyrus-imapd/0002-Avoid-returning-1-as-255.patch
[00:00:31] lbs-TBitsKolab16Test/cyrus-imapd/cyr_systemd_helper
[00:00:31] lbs-TBitsKolab16Test/cyrus-imapd/cyrus-imapd-2.5.11-41-gd53406f3f.tar.gz
[00:00:31] lbs-TBitsKolab16Test/cyrus-imapd/cyrus-imapd.cron-daily
[00:00:31] lbs-TBitsKolab16Test/cyrus-imapd/cyrus-imapd.cvt_cyrusdb_all
[00:00:31] lbs-TBitsKolab16Test/cyrus-imapd/cyrus-imapd.imap-2.3.x-conf
[00:00:31] lbs-TBitsKolab16Test/cyrus-imapd/cyrus-imapd.init
[00:00:31] lbs-TBitsKolab16Test/cyrus-imapd/cyrus-imapd.logrotate
[00:00:31] lbs-TBitsKolab16Test/cyrus-imapd/cyrus-imapd.magic
[00:00:31] lbs-TBitsKolab16Test/cyrus-imapd/cyrus-imapd.pam-config
[00:00:31] lbs-TBitsKolab16Test/cyrus-imapd/cyrus-imapd.service
[00:00:31] lbs-TBitsKolab16Test/cyrus-imapd/cyrus-imapd.spec
[00:00:31] lbs-TBitsKolab16Test/cyrus-imapd/cyrus-imapd.sysconfig
[00:00:31] lbs-TBitsKolab16Test/cyrus-imapd/cyrus-imapd.upstream
[00:00:31] lbs-TBitsKolab16Test/cyrus-imapd/cyrus_canonification_multiple_domains.patch
[00:00:31] lbs-TBitsKolab16Test/cyrus-imapd/cyrus_filter_kolab_mailboxes.patch
[00:00:31] lbs-TBitsKolab16Test/iRony/
[00:00:31] lbs-TBitsKolab16Test/iRony/add-sabre21-path-for-debian.patch
[00:00:31] lbs-TBitsKolab16Test/iRony/iRony-0.4.1.tar.gz
[00:00:32] lbs-TBitsKolab16Test/iRony/iRony.conf
[00:00:32] lbs-TBitsKolab16Test/iRony/iRony.logrotate
[00:00:32] lbs-TBitsKolab16Test/iRony/iRony.spec
[00:00:32] lbs-TBitsKolab16Test/kolab-autoconf/
[00:00:32] lbs-TBitsKolab16Test/kolab-autoconf/kolab-autoconf-1.3.tar.gz
[00:00:32] lbs-TBitsKolab16Test/kolab-autoconf/kolab-autoconf.spec
[00:00:32] lbs-TBitsKolab16Test/kolab-autoconf/kolab-autoconf.upstream
[00:00:32] lbs-TBitsKolab16Test/kolab-freebusy/
[00:00:32] lbs-TBitsKolab16Test/kolab-freebusy/kolab-freebusy-1.1.0.tar.gz
[00:00:32] lbs-TBitsKolab16Test/kolab-freebusy/kolab-freebusy.conf
[00:00:32] lbs-TBitsKolab16Test/kolab-freebusy/kolab-freebusy.logrotate
[00:00:32] lbs-TBitsKolab16Test/kolab-freebusy/kolab-freebusy.spec
[00:00:32] lbs-TBitsKolab16Test/kolab-freebusy/kolab-freebusy.upstream
[00:00:32] lbs-TBitsKolab16Test/kolab-schema/
[00:00:32] lbs-TBitsKolab16Test/kolab-schema/kolab-schema-3.3.tar.gz
[00:00:32] lbs-TBitsKolab16Test/kolab-schema/kolab-schema.spec
[00:00:32] lbs-TBitsKolab16Test/kolab-syncroton/
[00:00:32] lbs-TBitsKolab16Test/kolab-syncroton/kolab-syncroton-2.3.12.tar.gz
[00:00:32] lbs-TBitsKolab16Test/kolab-syncroton/kolab-syncroton.logrotate
[00:00:32] lbs-TBitsKolab16Test/kolab-syncroton/kolab-syncroton.spec
[00:00:32] lbs-TBitsKolab16Test/kolab-utils/
[00:00:32] lbs-TBitsKolab16Test/kolab-utils/0002-no-tests-for-fbdaemon.patch
[00:00:32] lbs-TBitsKolab16Test/kolab-utils/kolab-utils-3.1.4.tar.gz
[00:00:32] lbs-TBitsKolab16Test/kolab-utils/kolab-utils.spec
[00:00:32] lbs-TBitsKolab16Test/kolab-webadmin/
[00:00:32] lbs-TBitsKolab16Test/kolab-webadmin/99tbits.ldif
[00:00:32] lbs-TBitsKolab16Test/kolab-webadmin/canonification_via_uid_wap.patch
[00:00:32] lbs-TBitsKolab16Test/kolab-webadmin/domainAdminDefaultQuota.patch
[00:00:32] lbs-TBitsKolab16Test/kolab-webadmin/domainAdminMaxAccounts.patch
[00:00:32] lbs-TBitsKolab16Test/kolab-webadmin/domainquotaBug2046.patch
[00:00:32] lbs-TBitsKolab16Test/kolab-webadmin/dont_generate_attribs_when_editing.patch
[00:00:32] lbs-TBitsKolab16Test/kolab-webadmin/initTBitsUserTypes.php
[00:00:32] lbs-TBitsKolab16Test/kolab-webadmin/intranetToken-wap.patch
[00:00:32] lbs-TBitsKolab16Test/kolab-webadmin/kolab-webadmin-3.2.12.tar.gz
[00:00:32] lbs-TBitsKolab16Test/kolab-webadmin/kolab-webadmin.spec
[00:00:32] lbs-TBitsKolab16Test/kolab-webadmin/kolab-webadmin.upstream
[00:00:32] lbs-TBitsKolab16Test/kolab-webadmin/lastLoginTBitsAttribute-wap.patch
[00:00:32] lbs-TBitsKolab16Test/kolab-webadmin/listUsersLastLoginQuotaUsage.patch
[00:00:32] lbs-TBitsKolab16Test/kolab-webadmin/patchMultiDomainAdminsBug2018.patch
[00:00:32] lbs-TBitsKolab16Test/kolab-webadmin/quotaused_wap.patch
[00:00:32] lbs-TBitsKolab16Test/kolab-webadmin/validateAliasDomainPostfixVirtualFileBug2658.patch
[00:00:32] lbs-TBitsKolab16Test/kolab-webadmin/wap_api_listuserswithhash.patch
[00:00:32] lbs-TBitsKolab16Test/kolab-webadmin/wap_disallow_users.patch
[00:00:32] lbs-TBitsKolab16Test/kolab/
[00:00:32] lbs-TBitsKolab16Test/kolab/README
[00:00:32] lbs-TBitsKolab16Test/kolab/kolab-16.0.1.tar.gz
[00:00:32] lbs-TBitsKolab16Test/kolab/kolab.spec
[00:00:32] lbs-TBitsKolab16Test/kolab/kolab.upstream
[00:00:32] lbs-TBitsKolab16Test/libcalendaring/
[00:00:32] lbs-TBitsKolab16Test/libcalendaring/0001-Correct-shebangs.patch
[00:00:32] lbs-TBitsKolab16Test/libcalendaring/ical3-support.patch
[00:00:32] lbs-TBitsKolab16Test/libcalendaring/libcalendaring-4.9.2.tar.gz
[00:00:32] lbs-TBitsKolab16Test/libcalendaring/libcalendaring.spec
[00:00:32] lbs-TBitsKolab16Test/libkolab/
[00:00:32] lbs-TBitsKolab16Test/libkolab/libkolab-0.4.2-cmake-2.8.11.patch
[00:00:32] lbs-TBitsKolab16Test/libkolab/libkolab-0.5-swigutils.cmake.patch
[00:00:32] lbs-TBitsKolab16Test/libkolab/libkolab-2.0.tar.gz
[00:00:32] lbs-TBitsKolab16Test/libkolab/libkolab.spec
[00:00:32] lbs-TBitsKolab16Test/libkolabxml/
[00:00:32] lbs-TBitsKolab16Test/libkolabxml/fix-qverify-argument.patch
[00:00:32] lbs-TBitsKolab16Test/libkolabxml/libkolabxml-1.2.tar.gz
[00:00:32] lbs-TBitsKolab16Test/libkolabxml/libkolabxml.spec
[00:00:32] lbs-TBitsKolab16Test/libkolabxml/libossp-uuid-include.patch
[00:00:32] lbs-TBitsKolab16Test/mozldap/
[00:00:32] lbs-TBitsKolab16Test/mozldap/debian-aggregate.patch
[00:00:32] lbs-TBitsKolab16Test/mozldap/mozldap-6.0.7.tar.gz
[00:00:32] lbs-TBitsKolab16Test/mozldap/mozldap.spec
[00:00:32] lbs-TBitsKolab16Test/php-christianriesen-base32/
[00:00:32] lbs-TBitsKolab16Test/php-christianriesen-base32/christianriesen-base32-1.2.1.tar.gz
[00:00:32] lbs-TBitsKolab16Test/php-christianriesen-base32/php-christianriesen-base32.spec
[00:00:32] lbs-TBitsKolab16Test/php-endroid-qrcode/
[00:00:32] lbs-TBitsKolab16Test/php-endroid-qrcode/endroid-qrcode-1.5.4.tar.gz
[00:00:32] lbs-TBitsKolab16Test/php-endroid-qrcode/php-endroid-qrcode.spec
[00:00:32] lbs-TBitsKolab16Test/php-enygma-yubikey/
[00:00:32] lbs-TBitsKolab16Test/php-enygma-yubikey/enygma-yubikey-3.2.tar.gz
[00:00:32] lbs-TBitsKolab16Test/php-enygma-yubikey/php-enygma-yubikey.spec
[00:00:32] lbs-TBitsKolab16Test/php-sabre-dav/
[00:00:32] lbs-TBitsKolab16Test/php-sabre-dav/0001-Use-homemade-autoload.php.patch
[00:00:32] lbs-TBitsKolab16Test/php-sabre-dav/0002-Drop-Composer-autoLoader-calls.patch
[00:00:32] lbs-TBitsKolab16Test/php-sabre-dav/0003-Increase-timeout.patch
[00:00:32] lbs-TBitsKolab16Test/php-sabre-dav/0004-Install-sabredav.php-in-usr-share-php-sabre21-Sabre.patch
[00:00:32] lbs-TBitsKolab16Test/php-sabre-dav/0005-tfix-threshold.patch
[00:00:32] lbs-TBitsKolab16Test/php-sabre-dav/0006-tfix-selection.patch
[00:00:32] lbs-TBitsKolab16Test/php-sabre-dav/0007-Rename-naturalselection-as-naturalselection21.patch
[00:00:32] lbs-TBitsKolab16Test/php-sabre-dav/0008-Fix-upper-limit-after-spurious-upload-of-php-sabre-e.patch
[00:00:32] lbs-TBitsKolab16Test/php-sabre-dav/0009-naturalselection.1-wfix.patch
[00:00:32] lbs-TBitsKolab16Test/php-sabre-dav/autoload.php
[00:00:32] lbs-TBitsKolab16Test/php-sabre-dav/php-sabre-dav.spec
[00:00:32] lbs-TBitsKolab16Test/php-sabre-dav/sabre-dav-2.1.11.tar.gz
[00:00:32] lbs-TBitsKolab16Test/php-sabre-event/
[00:00:32] lbs-TBitsKolab16Test/php-sabre-event/php-sabre-event.spec
[00:00:32] lbs-TBitsKolab16Test/php-sabre-event/sabre-event-2.0.2.tar.gz
[00:00:32] lbs-TBitsKolab16Test/php-sabre-http/
[00:00:32] lbs-TBitsKolab16Test/php-sabre-http/0001-Use-homemade-autoload.php.patch
[00:00:32] lbs-TBitsKolab16Test/php-sabre-http/0002-Fix-upper-limit-after-spurious-upload-of-php-sabre-e.patch
[00:00:32] lbs-TBitsKolab16Test/php-sabre-http/php-sabre-http.spec
[00:00:32] lbs-TBitsKolab16Test/php-sabre-http/sabre-http-3.0.5.tar.gz
[00:00:32] lbs-TBitsKolab16Test/php-sabre-vobject/
[00:00:32] lbs-TBitsKolab16Test/php-sabre-vobject/0001-Use-homemade-autoloader.php.patch
[00:00:32] lbs-TBitsKolab16Test/php-sabre-vobject/0002-replace-with-homemade-tests-autoloader.patch
[00:00:32] lbs-TBitsKolab16Test/php-sabre-vobject/Canada-East-Saskatchewan-removed-in-2017.3.patch
[00:00:32] lbs-TBitsKolab16Test/php-sabre-vobject/T41247.patch
[00:00:32] lbs-TBitsKolab16Test/php-sabre-vobject/php-sabre-vobject.spec
[00:00:32] lbs-TBitsKolab16Test/php-sabre-vobject/sabre-vobject-3.5.3.tar.gz
[00:00:32] lbs-TBitsKolab16Test/php-sabre-vobject/sabre-vobject-bin.patch
[00:00:32] lbs-TBitsKolab16Test/php-spomky-labs-otphp/
[00:00:32] lbs-TBitsKolab16Test/php-spomky-labs-otphp/php-spomky-labs-otphp.spec
[00:00:32] lbs-TBitsKolab16Test/php-spomky-labs-otphp/spomky-labs-otphp-4.0.2.tar.gz
[00:00:32] lbs-TBitsKolab16Test/pykolab/
[00:00:32] lbs-TBitsKolab16Test/pykolab/allowPrimaryEmailAddressFromDomain.patch
[00:00:32] lbs-TBitsKolab16Test/pykolab/canonification_via_uid_pykolab.patch
[00:00:32] lbs-TBitsKolab16Test/pykolab/cyrus-imapd.conf-cert-paths.patch
[00:00:32] lbs-TBitsKolab16Test/pykolab/disableSpamFilter.patch
[00:00:32] lbs-TBitsKolab16Test/pykolab/disableSpamFilter2.patch
[00:00:32] lbs-TBitsKolab16Test/pykolab/fixPykolabIMAPKeepAlive.patch
[00:00:32] lbs-TBitsKolab16Test/pykolab/kolab_lam_invalid_mailbox_name.patch
[00:00:32] lbs-TBitsKolab16Test/pykolab/lastLoginTBitsAttribute-pykolab.patch
[00:00:32] lbs-TBitsKolab16Test/pykolab/logLoginData.patch
[00:00:32] lbs-TBitsKolab16Test/pykolab/onlyAllowKolabUsersToAuthViaSasl.patch
[00:00:32] lbs-TBitsKolab16Test/pykolab/pykolab-0.8-patch-out-manticore.patch
[00:00:32] lbs-TBitsKolab16Test/pykolab/pykolab-0.8.9.tar.gz
[00:00:32] lbs-TBitsKolab16Test/pykolab/pykolab.logrotate
[00:00:32] lbs-TBitsKolab16Test/pykolab/pykolab.spec
[00:00:32] lbs-TBitsKolab16Test/pykolab/pykolab.upstream
[00:00:32] lbs-TBitsKolab16Test/pykolab/pykolab_do_not_rename_existing_mailbox_T3315.patch
[00:00:32] lbs-TBitsKolab16Test/pykolab/pykolab_no_guam.patch
[00:00:32] lbs-TBitsKolab16Test/pykolab/pykolab_wap_client_unverified_context_localhost.patch
[00:00:32] lbs-TBitsKolab16Test/python-icalendar/
[00:00:32] lbs-TBitsKolab16Test/python-icalendar/icalendar-3.8.2.tar.gz
[00:00:32] lbs-TBitsKolab16Test/python-icalendar/python-icalendar.spec
[00:00:32] lbs-TBitsKolab16Test/python-sievelib/
[00:00:32] lbs-TBitsKolab16Test/python-sievelib/python-sievelib.spec
[00:00:32] lbs-TBitsKolab16Test/python-sievelib/sievelib-0.5.2.tar.gz
[00:00:32] lbs-TBitsKolab16Test/roundcubemail-plugin-contextmenu/
[00:00:32] lbs-TBitsKolab16Test/roundcubemail-plugin-contextmenu/README
[00:00:32] lbs-TBitsKolab16Test/roundcubemail-plugin-contextmenu/roundcubemail-plugin-contextmenu-2.3.tar.gz
[00:00:32] lbs-TBitsKolab16Test/roundcubemail-plugin-contextmenu/roundcubemail-plugin-contextmenu.spec
[00:00:32] lbs-TBitsKolab16Test/roundcubemail-plugin-ude_login/
[00:00:32] lbs-TBitsKolab16Test/roundcubemail-plugin-ude_login/comm.py
[00:00:32] lbs-TBitsKolab16Test/roundcubemail-plugin-ude_login/roundcubemail-plugin-ude_login-4.0.0.tar.gz
[00:00:32] lbs-TBitsKolab16Test/roundcubemail-plugin-ude_login/roundcubemail-plugin-ude_login.spec
[00:00:32] lbs-TBitsKolab16Test/roundcubemail-plugins-kolab/
[00:00:32] lbs-TBitsKolab16Test/roundcubemail-plugins-kolab/0001-Fix-missing-first-occurrence-of-an-event-when-moved-.patch
[00:00:32] lbs-TBitsKolab16Test/roundcubemail-plugins-kolab/canonification_via_uid_roundcube.patch
[00:00:32] lbs-TBitsKolab16Test/roundcubemail-plugins-kolab/comm.py
[00:00:32] lbs-TBitsKolab16Test/roundcubemail-plugins-kolab/plesk.calendar.inc.php
[00:00:32] lbs-TBitsKolab16Test/roundcubemail-plugins-kolab/plesk.kolab_addressbook.inc.php
[00:00:32] lbs-TBitsKolab16Test/roundcubemail-plugins-kolab/plesk.kolab_folders.inc.php
[00:00:32] lbs-TBitsKolab16Test/roundcubemail-plugins-kolab/plesk.libkolab.inc.php
[00:00:32] lbs-TBitsKolab16Test/roundcubemail-plugins-kolab/roundcubeStorageMariadbBug4883.patch
[00:00:32] lbs-TBitsKolab16Test/roundcubemail-plugins-kolab/roundcube_calendar_etc_timezone_T2666.patch
[00:00:32] lbs-TBitsKolab16Test/roundcubemail-plugins-kolab/roundcubemail-plugins-kolab-3.3-kolab-files-manticore-api.patch
[00:00:32] lbs-TBitsKolab16Test/roundcubemail-plugins-kolab/roundcubemail-plugins-kolab-3.3.6.tar.gz
[00:00:32] lbs-TBitsKolab16Test/roundcubemail-plugins-kolab/roundcubemail-plugins-kolab.spec
[00:00:32] lbs-TBitsKolab16Test/roundcubemail-plugins-kolab/roundcubemail-plugins-kolab.upstream
[00:00:32] lbs-TBitsKolab16Test/roundcubemail-skin-chameleon/
[00:00:32] lbs-TBitsKolab16Test/roundcubemail-skin-chameleon/roundcubemail-skin-chameleon-0.3.9.tar.gz
[00:00:33] lbs-TBitsKolab16Test/roundcubemail-skin-chameleon/roundcubemail-skin-chameleon.spec
[00:00:33] lbs-TBitsKolab16Test/roundcubemail/
[00:00:33] lbs-TBitsKolab16Test/roundcubemail/0002-Parse-all-quotas-from-GETQUOTAROOT-6280.patch
[00:00:33] lbs-TBitsKolab16Test/roundcubemail/0003-Update-changelog.patch
[00:00:33] lbs-TBitsKolab16Test/roundcubemail/0004-Fix-bug-where-some-escape-sequences-in-html-styles-c.patch
[00:00:33] lbs-TBitsKolab16Test/roundcubemail/0005-Fix-bug-where-some-forbidden-characters-on-Cyrus-IMA.patch
[00:00:33] lbs-TBitsKolab16Test/roundcubemail/2017111400.sql
[00:00:33] lbs-TBitsKolab16Test/roundcubemail/backport_managesieve_forwards.patch
[00:00:33] lbs-TBitsKolab16Test/roundcubemail/comm.py
[00:00:33] lbs-TBitsKolab16Test/roundcubemail/default-configuration.patch
[00:00:33] lbs-TBitsKolab16Test/roundcubemail/optional_disable_addressbook_export.patch
[00:00:33] lbs-TBitsKolab16Test/roundcubemail/plesk.config.inc.php
[00:00:33] lbs-TBitsKolab16Test/roundcubemail/plesk.managesieve.inc.php
[00:00:33] lbs-TBitsKolab16Test/roundcubemail/plesk.password.inc.php
[00:00:33] lbs-TBitsKolab16Test/roundcubemail/roundcubemail-1.3.6-plugin-enigma-homedir.patch
[00:00:33] lbs-TBitsKolab16Test/roundcubemail/roundcubemail-1.3.6.tar.gz
[00:00:33] lbs-TBitsKolab16Test/roundcubemail/roundcubemail-1.3.8.tar.gz
[00:00:33] lbs-TBitsKolab16Test/roundcubemail/roundcubemail.conf
[00:00:33] lbs-TBitsKolab16Test/roundcubemail/roundcubemail.logrotate
[00:00:33] lbs-TBitsKolab16Test/roundcubemail/roundcubemail.spec
[00:00:33] lbs-TBitsKolab16Test/roundcubemail/roundcubemail.upstream
[00:00:33] lbs-TBitsKolab16Test/roundcubemail/roundcubemail_messages.patch
[00:00:33] lbs-TBitsKolab16Test/updatePackages/
[00:00:33] lbs-TBitsKolab16Test/updatePackages/backport_managesieve_forwards.patch
[00:00:33] lbs-TBitsKolab16Test/updatePackages/comm.py
[00:00:33] lbs-TBitsKolab16Test/updatePackages/cyrus-imapd.patch
[00:00:33] lbs-TBitsKolab16Test/updatePackages/kolab-autoconf.patch
[00:00:33] lbs-TBitsKolab16Test/updatePackages/kolab-freebusy.patch
[00:00:33] lbs-TBitsKolab16Test/updatePackages/kolab-webadmin.patch
[00:00:33] lbs-TBitsKolab16Test/updatePackages/kolab.patch
[00:00:33] lbs-TBitsKolab16Test/updatePackages/pykolab.patch
[00:00:33] lbs-TBitsKolab16Test/updatePackages/pykolab_no_guam.patch
[00:00:33] lbs-TBitsKolab16Test/updatePackages/roundcubemail-1.3.8.tar.gz
[00:00:33] lbs-TBitsKolab16Test/updatePackages/roundcubemail-plugins-kolab.patch
[00:00:33] lbs-TBitsKolab16Test/updatePackages/roundcubemail.patch
[00:00:33] lbs-TBitsKolab16Test/updatePackages/roundcubemail_messages.patch
[00:00:33] lbs-TBitsKolab16Test/updatePackages/setup.sh
[00:00:33] 
[00:00:33] sent 56,489,780 bytes  received 3,916 bytes  22,597,478.40 bytes/sec
[00:00:33] total size is 57,609,851  speedup is 1.02
[00:00:33] now running: ssh -f -o "StrictHostKeyChecking no" -o Port=22 -i /etc/lightbuildserver/container/container_rsa root@10.0.3.5 "export LC_ALL=C; (if [ ! -f /etc/yum.repos.d/epel-release.repo ]; then exit -1; fi) 2>&1 && echo \$?"
[00:00:34] now running: ssh -f -o "StrictHostKeyChecking no" -o Port=22 -i /etc/lightbuildserver/container/container_rsa root@10.0.3.5 "export LC_ALL=C; (yum -y install epel-release) 2>&1 && echo \$?"
[00:00:34] Loaded plugins: fastestmirror, priorities
[00:00:34] Loading mirror speeds from cached hostfile
[00:00:34]  * base: centos.copahost.com
[00:00:34]  * extras: mirror.ratiokontakt.de
[00:00:34]  * updates: ftp.plusline.net
[00:00:34] Resolving Dependencies
[00:00:34] --> Running transaction check
[00:00:34] ---> Package epel-release.noarch 0:7-11 will be installed
[00:00:34] --> Finished Dependency Resolution
[00:00:34] 
[00:00:34] Dependencies Resolved
[00:00:34] 
[00:00:34] ================================================================================
[00:00:34]  Package                Arch             Version         Repository        Size
[00:00:34] ================================================================================
[00:00:34] Installing:
[00:00:34]  epel-release           noarch           7-11            extras            15 k
[00:00:34] 
[00:00:34] Transaction Summary
[00:00:34] ================================================================================
[00:00:34] Install  1 Package
[00:00:34] 
[00:00:34] Total size: 15 k
[00:00:34] Installed size: 24 k
[00:00:34] Downloading packages:
[00:00:34] Running transaction check
[00:00:34] Running transaction test
[00:00:34] Transaction test succeeded
[00:00:34] Running transaction
[00:00:34]   Installing : epel-release-7-11.noarch                                     1/1 
[00:00:34]   Verifying  : epel-release-7-11.noarch                                     1/1 
[00:00:34] 
[00:00:34] Installed:
[00:00:34]   epel-release.noarch 0:7-11                                                    
[00:00:34] 
[00:00:34] Complete!
[00:00:34] 0
[00:00:34] now running: rsync -avz --delete -e "ssh -i /etc/lightbuildserver/container/container_rsa -p 2222" /var/lib/lightbuildserver/repos/tbits.net/TBitsKolab16Test/centos/7/lbs-tbits.net-TBitsKolab16Test.repo root@build04lxc.lbs.solidcharity.com:/var/lib/lxc/005-build04lxc.lbs.solidcharity.com/rootfs/etc/yum.repos.d
[00:00:35] sending incremental file list
[00:00:35] lbs-tbits.net-TBitsKolab16Test.repo
[00:00:35] 
[00:00:35] sent 252 bytes  received 35 bytes  574.00 bytes/sec
[00:00:35] total size is 169  speedup is 0.59
[00:00:35] now running: ssh -f -o "StrictHostKeyChecking no" -o Port=22 -i /etc/lightbuildserver/container/container_rsa root@10.0.3.5 "export LC_ALL=C; (echo "priority = 60" >> /etc/yum.repos.d/lbs-tbits.net-TBitsKolab16Test.repo) 2>&1 && echo \$?"
[00:00:35] 0
[00:00:35] now running: ssh -f -o "StrictHostKeyChecking no" -o Port=22 -i /etc/lightbuildserver/container/container_rsa root@10.0.3.5 "export LC_ALL=C; (yum clean metadata) 2>&1 && echo \$?"
[00:00:35] Loaded plugins: fastestmirror, priorities
[00:00:35] Cleaning repos: base epel extras lbs-tbits.net-TBitsKolab16Test updates
[00:00:35] 19 metadata files removed
[00:00:35] 9 sqlite files removed
[00:00:35] 0 metadata files removed
[00:00:35] 0
[00:00:35] now running: ssh -f -o "StrictHostKeyChecking no" -o Port=22 -i /etc/lightbuildserver/container/container_rsa root@10.0.3.5 "export LC_ALL=C; (sed -e 's/Release:.*%{release}/Release: 0/g' lbs-TBitsKolab16Test/pykolab/pykolab.spec > /tmp/pykolab.spec) 2>&1 && echo \$?"
[00:00:35] 0
[00:00:35] now running: ssh -f -o "StrictHostKeyChecking no" -o Port=22 -i /etc/lightbuildserver/container/container_rsa root@10.0.3.5 "export LC_ALL=C; (yum-builddep -y /tmp/pykolab.spec) 2>&1 && echo \$?"
[00:00:36] Loaded plugins: fastestmirror, priorities
[00:00:36] Enabling epel-source repository
[00:00:36] Loading mirror speeds from cached hostfile
[00:00:39]  * base: centos.copahost.com
[00:00:40]  * epel: ftp.plusline.net
[00:00:40]  * epel-source: ftp.uni-stuttgart.de
[00:00:40]  * extras: mirror.ratiokontakt.de
[00:00:40]  * updates: ftp.plusline.net
[00:00:46] 13 packages excluded due to repository priority protections
[00:00:46] Checking for new repos for mirrors
[00:00:48] Getting requirements for /tmp/pykolab.spec
[00:00:48]  --> Already installed : gcc-4.8.5-36.el7.x86_64
[00:00:48]  --> gettext-0.19.8.1-2.el7.x86_64
[00:00:48]  --> glib2-devel-2.56.1-2.el7.x86_64
[00:00:48]  --> intltool-0.50.2-7.el7.noarch
[00:00:48]  --> MySQL-python-1.2.5-1.el7.x86_64
[00:00:48]  --> Already installed : python-2.7.5-76.el7.x86_64
[00:00:48]  --> python-augeas-0.5.0-2.el7.noarch
[00:00:48]  --> python2-gnupg-0.4.3-1.el7.noarch
[00:00:48]  --> python-icalendar-3.8.2-1.el7.noarch
[00:00:48]  --> python-kolab-2.0-0.1.dev20150112.gitf0f953aa.el7.x86_64
[00:00:48]  --> python-kolabformat-1.2-0.20160909.git.el7.x86_64
[00:00:48]  --> python-ldap-2.4.15-2.el7.x86_64
[00:00:48]  --> python-nose-1.3.7-1.el7.noarch
[00:00:48]  --> python-pep8-1.4.6-3.el7.noarch
[00:00:48]  --> python2-pyasn1-0.1.9-7.el7.noarch
[00:00:48]  --> python2-pyasn1-modules-0.1.9-7.el7.noarch
[00:00:48]  --> pytz-2016.10-2.el7.noarch
[00:00:48]  --> python-sievelib-0.5.2-2.el7.noarch
[00:00:48]  --> python-sqlalchemy-0.9.8-2.el7.x86_64
[00:00:48]  --> python-twisted-core-12.2.0-4.el7.x86_64
[00:00:48]  --> python-tzlocal-1.2-2.el7.noarch
[00:00:48] --> Running transaction check
[00:00:48] ---> Package MySQL-python.x86_64 0:1.2.5-1.el7 will be installed
[00:00:48] --> Processing Dependency: libmysqlclient.so.18(libmysqlclient_18)(64bit) for package: MySQL-python-1.2.5-1.el7.x86_64
[00:00:48] --> Processing Dependency: libmysqlclient.so.18()(64bit) for package: MySQL-python-1.2.5-1.el7.x86_64
[00:00:48] ---> Package gettext.x86_64 0:0.19.8.1-2.el7 will be installed
[00:00:48] --> Processing Dependency: gettext-libs(x86-64) = 0.19.8.1-2.el7 for package: gettext-0.19.8.1-2.el7.x86_64
[00:00:48] --> Processing Dependency: libunistring.so.0()(64bit) for package: gettext-0.19.8.1-2.el7.x86_64
[00:00:48] --> Processing Dependency: libgettextsrc-0.19.8.1.so()(64bit) for package: gettext-0.19.8.1-2.el7.x86_64
[00:00:48] --> Processing Dependency: libgettextlib-0.19.8.1.so()(64bit) for package: gettext-0.19.8.1-2.el7.x86_64
[00:00:48] --> Processing Dependency: libcroco-0.6.so.3()(64bit) for package: gettext-0.19.8.1-2.el7.x86_64
[00:00:48] ---> Package glib2-devel.x86_64 0:2.56.1-2.el7 will be installed
[00:00:48] --> Processing Dependency: pkgconfig(libpcre) for package: glib2-devel-2.56.1-2.el7.x86_64
[00:00:48] ---> Package intltool.noarch 0:0.50.2-7.el7 will be installed
[00:00:48] --> Processing Dependency: perl(XML::Parser) for package: intltool-0.50.2-7.el7.noarch
[00:00:48] --> Processing Dependency: gettext-devel for package: intltool-0.50.2-7.el7.noarch
[00:00:48] --> Processing Dependency: automake for package: intltool-0.50.2-7.el7.noarch
[00:00:48] ---> Package python-augeas.noarch 0:0.5.0-2.el7 will be installed
[00:00:48] --> Processing Dependency: augeas-libs for package: python-augeas-0.5.0-2.el7.noarch
[00:00:48] ---> Package python-icalendar.noarch 0:3.8.2-1.el7 will be installed
[00:00:48] --> Processing Dependency: python-dateutil for package: python-icalendar-3.8.2-1.el7.noarch
[00:00:48] ---> Package python-kolab.x86_64 0:2.0-0.1.dev20150112.gitf0f953aa.el7 will be installed
[00:00:48] --> Processing Dependency: libkolab(x86-64) = 2.0 for package: python-kolab-2.0-0.1.dev20150112.gitf0f953aa.el7.x86_64
[00:00:48] --> Processing Dependency: libxerces-c-3.1.so()(64bit) for package: python-kolab-2.0-0.1.dev20150112.gitf0f953aa.el7.x86_64
[00:00:48] --> Processing Dependency: libkolabxml.so.1()(64bit) for package: python-kolab-2.0-0.1.dev20150112.gitf0f953aa.el7.x86_64
[00:00:48] --> Processing Dependency: libkolab.so.2()(64bit) for package: python-kolab-2.0-0.1.dev20150112.gitf0f953aa.el7.x86_64
[00:00:48] --> Processing Dependency: libcalendaring-kpimutils.so.0()(64bit) for package: python-kolab-2.0-0.1.dev20150112.gitf0f953aa.el7.x86_64
[00:00:48] --> Processing Dependency: libcalendaring-kmime.so.0()(64bit) for package: python-kolab-2.0-0.1.dev20150112.gitf0f953aa.el7.x86_64
[00:00:48] --> Processing Dependency: libcalendaring-kimap.so.0()(64bit) for package: python-kolab-2.0-0.1.dev20150112.gitf0f953aa.el7.x86_64
[00:00:48] --> Processing Dependency: libcalendaring-kdecore.so.0()(64bit) for package: python-kolab-2.0-0.1.dev20150112.gitf0f953aa.el7.x86_64
[00:00:48] --> Processing Dependency: libcalendaring-kcalutils.so.0()(64bit) for package: python-kolab-2.0-0.1.dev20150112.gitf0f953aa.el7.x86_64
[00:00:48] --> Processing Dependency: libcalendaring-kcalcore.so.0()(64bit) for package: python-kolab-2.0-0.1.dev20150112.gitf0f953aa.el7.x86_64
[00:00:48] --> Processing Dependency: libcalendaring-kabc.so.0()(64bit) for package: python-kolab-2.0-0.1.dev20150112.gitf0f953aa.el7.x86_64
[00:00:48] --> Processing Dependency: libcalendaring-akonadi-notes.so.0()(64bit) for package: python-kolab-2.0-0.1.dev20150112.gitf0f953aa.el7.x86_64
[00:00:48] --> Processing Dependency: libboost_thread-mt.so.1.53.0()(64bit) for package: python-kolab-2.0-0.1.dev20150112.gitf0f953aa.el7.x86_64
[00:00:48] --> Processing Dependency: libboost_system-mt.so.1.53.0()(64bit) for package: python-kolab-2.0-0.1.dev20150112.gitf0f953aa.el7.x86_64
[00:00:48] --> Processing Dependency: libQtXml.so.4()(64bit) for package: python-kolab-2.0-0.1.dev20150112.gitf0f953aa.el7.x86_64
[00:00:48] --> Processing Dependency: libQtGui.so.4()(64bit) for package: python-kolab-2.0-0.1.dev20150112.gitf0f953aa.el7.x86_64
[00:00:48] --> Processing Dependency: libQtCore.so.4()(64bit) for package: python-kolab-2.0-0.1.dev20150112.gitf0f953aa.el7.x86_64
[00:00:48] ---> Package python-kolabformat.x86_64 0:1.2-0.20160909.git.el7 will be installed
[00:00:48] ---> Package python-ldap.x86_64 0:2.4.15-2.el7 will be installed
[00:00:48] ---> Package python-nose.noarch 0:1.3.7-1.el7 will be installed
[00:00:48] --> Processing Dependency: python-setuptools for package: python-nose-1.3.7-1.el7.noarch
[00:00:48] ---> Package python-pep8.noarch 0:1.4.6-3.el7 will be installed
[00:00:48] ---> Package python-sievelib.noarch 0:0.5.2-2.el7 will be installed
[00:00:48] ---> Package python-sqlalchemy.x86_64 0:0.9.8-2.el7 will be installed
[00:00:48] ---> Package python-twisted-core.x86_64 0:12.2.0-4.el7 will be installed
[00:00:48] --> Processing Dependency: python-zope-interface for package: python-twisted-core-12.2.0-4.el7.x86_64
[00:00:48] --> Processing Dependency: pyserial for package: python-twisted-core-12.2.0-4.el7.x86_64
[00:00:48] --> Processing Dependency: pyOpenSSL for package: python-twisted-core-12.2.0-4.el7.x86_64
[00:00:48] ---> Package python-tzlocal.noarch 0:1.2-2.el7 will be installed
[00:00:48] ---> Package python2-gnupg.noarch 0:0.4.3-1.el7 will be installed
[00:00:48] ---> Package python2-pyasn1.noarch 0:0.1.9-7.el7 will be installed
[00:00:48] ---> Package python2-pyasn1-modules.noarch 0:0.1.9-7.el7 will be installed
[00:00:48] ---> Package pytz.noarch 0:2016.10-2.el7 will be installed
[00:00:48] --> Running transaction check
[00:00:48] ---> Package augeas-libs.x86_64 0:1.4.0-6.el7 will be installed
[00:00:48] ---> Package automake.noarch 0:1.13.4-3.el7 will be installed
[00:00:48] --> Processing Dependency: autoconf >= 2.65 for package: automake-1.13.4-3.el7.noarch
[00:00:48] --> Processing Dependency: perl(TAP::Parser) for package: automake-1.13.4-3.el7.noarch
[00:00:48] ---> Package boost-system.x86_64 0:1.53.0-27.el7 will be installed
[00:00:48] ---> Package boost-thread.x86_64 0:1.53.0-27.el7 will be installed
[00:00:48] ---> Package gettext-devel.x86_64 0:0.19.8.1-2.el7 will be installed
[00:00:48] --> Processing Dependency: gettext-common-devel = 0.19.8.1-2.el7 for package: gettext-devel-0.19.8.1-2.el7.x86_64
[00:00:48] --> Processing Dependency: git for package: gettext-devel-0.19.8.1-2.el7.x86_64
[00:00:48] ---> Package gettext-libs.x86_64 0:0.19.8.1-2.el7 will be installed
[00:00:48] ---> Package libcalendaring.x86_64 0:4.9.2-0.20160905.git.el7 will be installed
[00:00:48] --> Processing Dependency: libicalss.so.3()(64bit) for package: libcalendaring-4.9.2-0.20160905.git.el7.x86_64
[00:00:48] --> Processing Dependency: libical.so.3()(64bit) for package: libcalendaring-4.9.2-0.20160905.git.el7.x86_64
[00:00:48] ---> Package libcroco.x86_64 0:0.6.12-4.el7 will be installed
[00:00:48] ---> Package libkolab.x86_64 0:2.0-0.1.dev20150112.gitf0f953aa.el7 will be installed
[00:00:48] ---> Package libkolabxml.x86_64 0:1.2-0.20160909.git.el7 will be installed
[00:00:48] ---> Package libunistring.x86_64 0:0.9.3-9.el7 will be installed
[00:00:48] ---> Package mariadb-libs.x86_64 1:5.5.60-1.el7_5 will be installed
[00:00:48] ---> Package pcre-devel.x86_64 0:8.32-17.el7 will be installed
[00:00:48] ---> Package perl-XML-Parser.x86_64 0:2.41-10.el7 will be installed
[00:00:48] ---> Package pyOpenSSL.x86_64 0:0.13.1-4.el7 will be installed
[00:00:48] ---> Package pyserial.noarch 0:2.6-6.el7 will be installed
[00:00:48] ---> Package python-dateutil.noarch 0:1.5-7.el7 will be installed
[00:00:48] ---> Package python-setuptools.noarch 0:0.9.8-7.el7 will be installed
[00:00:48] --> Processing Dependency: python-backports-ssl_match_hostname for package: python-setuptools-0.9.8-7.el7.noarch
[00:00:48] ---> Package python-zope-interface.x86_64 0:4.0.5-4.el7 will be installed
[00:00:48] ---> Package qt.x86_64 1:4.8.7-2.el7 will be installed
[00:00:48] --> Processing Dependency: qt-settings for package: 1:qt-4.8.7-2.el7.x86_64
[00:00:48] ---> Package qt-x11.x86_64 1:4.8.7-2.el7 will be installed
[00:00:48] --> Processing Dependency: libtiff.so.5(LIBTIFF_4.0)(64bit) for package: 1:qt-x11-4.8.7-2.el7.x86_64
[00:00:48] --> Processing Dependency: libpng15.so.15(PNG15_0)(64bit) for package: 1:qt-x11-4.8.7-2.el7.x86_64
[00:00:48] --> Processing Dependency: libjpeg.so.62(LIBJPEG_6.2)(64bit) for package: 1:qt-x11-4.8.7-2.el7.x86_64
[00:00:48] --> Processing Dependency: libasound.so.2(ALSA_0.9.0rc4)(64bit) for package: 1:qt-x11-4.8.7-2.el7.x86_64
[00:00:48] --> Processing Dependency: libasound.so.2(ALSA_0.9)(64bit) for package: 1:qt-x11-4.8.7-2.el7.x86_64
[00:00:48] --> Processing Dependency: libtiff.so.5()(64bit) for package: 1:qt-x11-4.8.7-2.el7.x86_64
[00:00:48] --> Processing Dependency: libpng15.so.15()(64bit) for package: 1:qt-x11-4.8.7-2.el7.x86_64
[00:00:48] --> Processing Dependency: libmng.so.1()(64bit) for package: 1:qt-x11-4.8.7-2.el7.x86_64
[00:00:48] --> Processing Dependency: libjpeg.so.62()(64bit) for package: 1:qt-x11-4.8.7-2.el7.x86_64
[00:00:48] --> Processing Dependency: libfreetype.so.6()(64bit) for package: 1:qt-x11-4.8.7-2.el7.x86_64
[00:00:48] --> Processing Dependency: libfontconfig.so.1()(64bit) for package: 1:qt-x11-4.8.7-2.el7.x86_64
[00:00:48] --> Processing Dependency: libasound.so.2()(64bit) for package: 1:qt-x11-4.8.7-2.el7.x86_64
[00:00:48] --> Processing Dependency: libXrender.so.1()(64bit) for package: 1:qt-x11-4.8.7-2.el7.x86_64
[00:00:48] --> Processing Dependency: libXrandr.so.2()(64bit) for package: 1:qt-x11-4.8.7-2.el7.x86_64
[00:00:48] --> Processing Dependency: libXinerama.so.1()(64bit) for package: 1:qt-x11-4.8.7-2.el7.x86_64
[00:00:48] --> Processing Dependency: libXi.so.6()(64bit) for package: 1:qt-x11-4.8.7-2.el7.x86_64
[00:00:48] --> Processing Dependency: libXfixes.so.3()(64bit) for package: 1:qt-x11-4.8.7-2.el7.x86_64
[00:00:48] --> Processing Dependency: libXext.so.6()(64bit) for package: 1:qt-x11-4.8.7-2.el7.x86_64
[00:00:48] --> Processing Dependency: libXcursor.so.1()(64bit) for package: 1:qt-x11-4.8.7-2.el7.x86_64
[00:00:48] --> Processing Dependency: libX11.so.6()(64bit) for package: 1:qt-x11-4.8.7-2.el7.x86_64
[00:00:48] --> Processing Dependency: libSM.so.6()(64bit) for package: 1:qt-x11-4.8.7-2.el7.x86_64
[00:00:48] --> Processing Dependency: libICE.so.6()(64bit) for package: 1:qt-x11-4.8.7-2.el7.x86_64
[00:00:48] --> Processing Dependency: libGL.so.1()(64bit) for package: 1:qt-x11-4.8.7-2.el7.x86_64
[00:00:48] ---> Package xerces-c.x86_64 0:3.1.1-9.el7 will be installed
[00:00:48] --> Running transaction check
[00:00:48] ---> Package alsa-lib.x86_64 0:1.1.6-2.el7 will be installed
[00:00:48] ---> Package autoconf.noarch 0:2.69-11.el7 will be installed
[00:00:48] --> Processing Dependency: m4 >= 1.4.14 for package: autoconf-2.69-11.el7.noarch
[00:00:48] --> Processing Dependency: perl(Data::Dumper) for package: autoconf-2.69-11.el7.noarch
[00:00:48] ---> Package fontconfig.x86_64 0:2.13.0-4.3.el7 will be installed
[00:00:48] --> Processing Dependency: fontpackages-filesystem for package: fontconfig-2.13.0-4.3.el7.x86_64
[00:00:48] --> Processing Dependency: dejavu-sans-fonts for package: fontconfig-2.13.0-4.3.el7.x86_64
[00:00:48] ---> Package freetype.x86_64 0:2.8-12.el7 will be installed
[00:00:48] ---> Package gettext-common-devel.noarch 0:0.19.8.1-2.el7 will be installed
[00:00:48] ---> Package git.x86_64 0:1.8.3.1-20.el7 will be installed
[00:00:48] --> Processing Dependency: perl-Git = 1.8.3.1-20.el7 for package: git-1.8.3.1-20.el7.x86_64
[00:00:48] --> Processing Dependency: perl(Term::ReadKey) for package: git-1.8.3.1-20.el7.x86_64
[00:00:48] --> Processing Dependency: perl(Git) for package: git-1.8.3.1-20.el7.x86_64
[00:00:48] --> Processing Dependency: perl(Error) for package: git-1.8.3.1-20.el7.x86_64
[00:00:48] --> Processing Dependency: less for package: git-1.8.3.1-20.el7.x86_64
[00:00:48] ---> Package libICE.x86_64 0:1.0.9-9.el7 will be installed
[00:00:48] ---> Package libSM.x86_64 0:1.2.2-2.el7 will be installed
[00:00:48] ---> Package libX11.x86_64 0:1.6.5-2.el7 will be installed
[00:00:48] --> Processing Dependency: libX11-common >= 1.6.5-2.el7 for package: libX11-1.6.5-2.el7.x86_64
[00:00:48] --> Processing Dependency: libxcb.so.1()(64bit) for package: libX11-1.6.5-2.el7.x86_64
[00:00:48] ---> Package libXcursor.x86_64 0:1.1.15-1.el7 will be installed
[00:00:48] ---> Package libXext.x86_64 0:1.3.3-3.el7 will be installed
[00:00:48] ---> Package libXfixes.x86_64 0:5.0.3-1.el7 will be installed
[00:00:48] ---> Package libXi.x86_64 0:1.7.9-1.el7 will be installed
[00:00:48] ---> Package libXinerama.x86_64 0:1.1.3-2.1.el7 will be installed
[00:00:48] ---> Package libXrandr.x86_64 0:1.5.1-2.el7 will be installed
[00:00:48] ---> Package libXrender.x86_64 0:0.9.10-1.el7 will be installed
[00:00:48] ---> Package libglvnd-glx.x86_64 1:1.0.1-0.8.git5baa1e5.el7 will be installed
[00:00:48] --> Processing Dependency: libglvnd(x86-64) = 1:1.0.1-0.8.git5baa1e5.el7 for package: 1:libglvnd-glx-1.0.1-0.8.git5baa1e5.el7.x86_64
[00:00:48] --> Processing Dependency: mesa-libGL(x86-64) >= 13.0.4-1 for package: 1:libglvnd-glx-1.0.1-0.8.git5baa1e5.el7.x86_64
[00:00:48] --> Processing Dependency: libGLdispatch.so.0()(64bit) for package: 1:libglvnd-glx-1.0.1-0.8.git5baa1e5.el7.x86_64
[00:00:48] ---> Package libical.x86_64 0:3.0.3-2.el7 will be installed
[00:00:48] --> Processing Dependency: libicuuc.so.50()(64bit) for package: libical-3.0.3-2.el7.x86_64
[00:00:48] --> Processing Dependency: libicui18n.so.50()(64bit) for package: libical-3.0.3-2.el7.x86_64
[00:00:48] ---> Package libjpeg-turbo.x86_64 0:1.2.90-6.el7 will be installed
[00:00:48] ---> Package libmng.x86_64 0:1.0.10-14.el7 will be installed
[00:00:48] ---> Package libpng.x86_64 2:1.5.13-7.el7_2 will be installed
[00:00:48] ---> Package libtiff.x86_64 0:4.0.3-27.el7_3 will be installed
[00:00:48] --> Processing Dependency: libjbig.so.2.0()(64bit) for package: libtiff-4.0.3-27.el7_3.x86_64
[00:00:48] ---> Package perl-Test-Harness.noarch 0:3.28-3.el7 will be installed
[00:00:48] ---> Package python-backports-ssl_match_hostname.noarch 0:3.5.0.1-1.el7 will be installed
[00:00:48] --> Processing Dependency: python-ipaddress for package: python-backports-ssl_match_hostname-3.5.0.1-1.el7.noarch
[00:00:48] --> Processing Dependency: python-backports for package: python-backports-ssl_match_hostname-3.5.0.1-1.el7.noarch
[00:00:48] ---> Package qt-settings.noarch 0:19-23.8.el7.centos will be installed
[00:00:48] --> Processing Dependency: pciutils for package: qt-settings-19-23.8.el7.centos.noarch
[00:00:48] --> Running transaction check
[00:00:48] ---> Package dejavu-sans-fonts.noarch 0:2.33-6.el7 will be installed
[00:00:48] --> Processing Dependency: dejavu-fonts-common = 2.33-6.el7 for package: dejavu-sans-fonts-2.33-6.el7.noarch
[00:00:48] ---> Package fontpackages-filesystem.noarch 0:1.44-8.el7 will be installed
[00:00:48] ---> Package jbigkit-libs.x86_64 0:2.0-11.el7 will be installed
[00:00:48] ---> Package less.x86_64 0:458-9.el7 will be installed
[00:00:48] ---> Package libX11-common.noarch 0:1.6.5-2.el7 will be installed
[00:00:48] ---> Package libglvnd.x86_64 1:1.0.1-0.8.git5baa1e5.el7 will be installed
[00:00:48] ---> Package libicu.x86_64 0:50.1.2-17.el7 will be installed
[00:00:48] ---> Package libxcb.x86_64 0:1.13-1.el7 will be installed
[00:00:48] --> Processing Dependency: libXau.so.6()(64bit) for package: libxcb-1.13-1.el7.x86_64
[00:00:48] ---> Package m4.x86_64 0:1.4.16-10.el7 will be installed
[00:00:48] ---> Package mesa-libGL.x86_64 0:18.0.5-3.el7 will be installed
[00:00:48] --> Processing Dependency: mesa-libglapi = 18.0.5-3.el7 for package: mesa-libGL-18.0.5-3.el7.x86_64
[00:00:48] --> Processing Dependency: libdrm >= 2.4.83 for package: mesa-libGL-18.0.5-3.el7.x86_64
[00:00:48] --> Processing Dependency: libxshmfence.so.1()(64bit) for package: mesa-libGL-18.0.5-3.el7.x86_64
[00:00:48] --> Processing Dependency: libglapi.so.0()(64bit) for package: mesa-libGL-18.0.5-3.el7.x86_64
[00:00:48] --> Processing Dependency: libdrm.so.2()(64bit) for package: mesa-libGL-18.0.5-3.el7.x86_64
[00:00:48] --> Processing Dependency: libXxf86vm.so.1()(64bit) for package: mesa-libGL-18.0.5-3.el7.x86_64
[00:00:48] --> Processing Dependency: libXdamage.so.1()(64bit) for package: mesa-libGL-18.0.5-3.el7.x86_64
[00:00:48] ---> Package pciutils.x86_64 0:3.5.1-3.el7 will be installed
[00:00:48] --> Processing Dependency: pciutils-libs = 3.5.1-3.el7 for package: pciutils-3.5.1-3.el7.x86_64
[00:00:48] --> Processing Dependency: libpci.so.3(LIBPCI_3.5)(64bit) for package: pciutils-3.5.1-3.el7.x86_64
[00:00:48] --> Processing Dependency: libpci.so.3(LIBPCI_3.3)(64bit) for package: pciutils-3.5.1-3.el7.x86_64
[00:00:48] --> Processing Dependency: libpci.so.3(LIBPCI_3.1)(64bit) for package: pciutils-3.5.1-3.el7.x86_64
[00:00:48] --> Processing Dependency: libpci.so.3(LIBPCI_3.0)(64bit) for package: pciutils-3.5.1-3.el7.x86_64
[00:00:48] --> Processing Dependency: hwdata for package: pciutils-3.5.1-3.el7.x86_64
[00:00:48] --> Processing Dependency: libpci.so.3()(64bit) for package: pciutils-3.5.1-3.el7.x86_64
[00:00:48] ---> Package perl-Data-Dumper.x86_64 0:2.145-3.el7 will be installed
[00:00:48] ---> Package perl-Error.noarch 1:0.17020-2.el7 will be installed
[00:00:48] ---> Package perl-Git.noarch 0:1.8.3.1-20.el7 will be installed
[00:00:48] ---> Package perl-TermReadKey.x86_64 0:2.30-20.el7 will be installed
[00:00:48] ---> Package python-backports.x86_64 0:1.0-8.el7 will be installed
[00:00:48] ---> Package python-ipaddress.noarch 0:1.0.16-2.el7 will be installed
[00:00:48] --> Running transaction check
[00:00:48] ---> Package dejavu-fonts-common.noarch 0:2.33-6.el7 will be installed
[00:00:48] ---> Package hwdata.x86_64 0:0.252-9.1.el7 will be installed
[00:00:48] ---> Package libXau.x86_64 0:1.0.8-2.1.el7 will be installed
[00:00:48] ---> Package libXdamage.x86_64 0:1.1.4-4.1.el7 will be installed
[00:00:48] ---> Package libXxf86vm.x86_64 0:1.1.4-1.el7 will be installed
[00:00:48] ---> Package libdrm.x86_64 0:2.4.91-3.el7 will be installed
[00:00:48] --> Processing Dependency: libpciaccess.so.0()(64bit) for package: libdrm-2.4.91-3.el7.x86_64
[00:00:48] ---> Package libxshmfence.x86_64 0:1.2-1.el7 will be installed
[00:00:48] ---> Package mesa-libglapi.x86_64 0:18.0.5-3.el7 will be installed
[00:00:48] ---> Package pciutils-libs.x86_64 0:3.5.1-3.el7 will be installed
[00:00:48] --> Running transaction check
[00:00:48] ---> Package libpciaccess.x86_64 0:0.14-1.el7 will be installed
[00:00:48] --> Finished Dependency Resolution
[00:00:49] 
[00:00:49] Dependencies Resolved
[00:00:51] 
[00:00:51] ================================================================================
[00:00:51]  Package               Arch   Version                             Repository
[00:00:51]                                                                            Size
[00:00:51] ================================================================================
[00:00:51] Installing:
[00:00:51]  MySQL-python          x86_64 1.2.5-1.el7                         base     90 k
[00:00:51]  gettext               x86_64 0.19.8.1-2.el7                      base    1.0 M
[00:00:51]  glib2-devel           x86_64 2.56.1-2.el7                        base    453 k
[00:00:51]  intltool              noarch 0.50.2-7.el7                        base     59 k
[00:00:51]  python-augeas         noarch 0.5.0-2.el7                         base     25 k
[00:00:51]  python-icalendar      noarch 3.8.2-1.el7                         lbs-tbits.net-TBitsKolab16Test
[00:00:51]                                                                            92 k
[00:00:51]  python-kolab          x86_64 2.0-0.1.dev20150112.gitf0f953aa.el7 lbs-tbits.net-TBitsKolab16Test
[00:00:51]                                                                            76 k
[00:00:51]  python-kolabformat    x86_64 1.2-0.20160909.git.el7              lbs-tbits.net-TBitsKolab16Test
[00:00:51]                                                                           438 k
[00:00:51]  python-ldap           x86_64 2.4.15-2.el7                        base    159 k
[00:00:51]  python-nose           noarch 1.3.7-1.el7                         base    276 k
[00:00:51]  python-pep8           noarch 1.4.6-3.el7                         epel    146 k
[00:00:51]  python-sievelib       noarch 0.5.2-2.el7                         lbs-tbits.net-TBitsKolab16Test
[00:00:51]                                                                            40 k
[00:00:51]  python-sqlalchemy     x86_64 0.9.8-2.el7                         base    2.9 M
[00:00:51]  python-twisted-core   x86_64 12.2.0-4.el7                        base    2.5 M
[00:00:51]  python-tzlocal        noarch 1.2-2.el7                           epel     27 k
[00:00:51]  python2-gnupg         noarch 0.4.3-1.el7                         epel     40 k
[00:00:51]  python2-pyasn1        noarch 0.1.9-7.el7                         base    100 k
[00:00:51]  python2-pyasn1-modules
[00:00:51]                        noarch 0.1.9-7.el7                         base     59 k
[00:00:51]  pytz                  noarch 2016.10-2.el7                       base     46 k
[00:00:51] Installing for dependencies:
[00:00:51]  alsa-lib              x86_64 1.1.6-2.el7                         base    424 k
[00:00:51]  augeas-libs           x86_64 1.4.0-6.el7                         base    355 k
[00:00:51]  autoconf              noarch 2.69-11.el7                         base    701 k
[00:00:51]  automake              noarch 1.13.4-3.el7                        base    679 k
[00:00:51]  boost-system          x86_64 1.53.0-27.el7                       base     40 k
[00:00:51]  boost-thread          x86_64 1.53.0-27.el7                       base     57 k
[00:00:51]  dejavu-fonts-common   noarch 2.33-6.el7                          base     64 k
[00:00:51]  dejavu-sans-fonts     noarch 2.33-6.el7                          base    1.4 M
[00:00:51]  fontconfig            x86_64 2.13.0-4.3.el7                      base    254 k
[00:00:51]  fontpackages-filesystem
[00:00:51]                        noarch 1.44-8.el7                          base    9.9 k
[00:00:51]  freetype              x86_64 2.8-12.el7                          base    380 k
[00:00:51]  gettext-common-devel  noarch 0.19.8.1-2.el7                      base    410 k
[00:00:51]  gettext-devel         x86_64 0.19.8.1-2.el7                      base    320 k
[00:00:51]  gettext-libs          x86_64 0.19.8.1-2.el7                      base    501 k
[00:00:51]  git                   x86_64 1.8.3.1-20.el7                      updates 4.4 M
[00:00:51]  hwdata                x86_64 0.252-9.1.el7                       base    2.3 M
[00:00:51]  jbigkit-libs          x86_64 2.0-11.el7                          base     46 k
[00:00:51]  less                  x86_64 458-9.el7                           base    120 k
[00:00:51]  libICE                x86_64 1.0.9-9.el7                         base     66 k
[00:00:51]  libSM                 x86_64 1.2.2-2.el7                         base     39 k
[00:00:51]  libX11                x86_64 1.6.5-2.el7                         base    606 k
[00:00:51]  libX11-common         noarch 1.6.5-2.el7                         base    164 k
[00:00:51]  libXau                x86_64 1.0.8-2.1.el7                       base     29 k
[00:00:51]  libXcursor            x86_64 1.1.15-1.el7                        base     30 k
[00:00:51]  libXdamage            x86_64 1.1.4-4.1.el7                       base     20 k
[00:00:51]  libXext               x86_64 1.3.3-3.el7                         base     39 k
[00:00:51]  libXfixes             x86_64 5.0.3-1.el7                         base     18 k
[00:00:51]  libXi                 x86_64 1.7.9-1.el7                         base     40 k
[00:00:51]  libXinerama           x86_64 1.1.3-2.1.el7                       base     14 k
[00:00:51]  libXrandr             x86_64 1.5.1-2.el7                         base     27 k
[00:00:51]  libXrender            x86_64 0.9.10-1.el7                        base     26 k
[00:00:51]  libXxf86vm            x86_64 1.1.4-1.el7                         base     18 k
[00:00:51]  libcalendaring        x86_64 4.9.2-0.20160905.git.el7            lbs-tbits.net-TBitsKolab16Test
[00:00:51]                                                                           1.7 M
[00:00:51]  libcroco              x86_64 0.6.12-4.el7                        base    105 k
[00:00:51]  libdrm                x86_64 2.4.91-3.el7                        base    153 k
[00:00:51]  libglvnd              x86_64 1:1.0.1-0.8.git5baa1e5.el7          base     89 k
[00:00:51]  libglvnd-glx          x86_64 1:1.0.1-0.8.git5baa1e5.el7          base    125 k
[00:00:51]  libical               x86_64 3.0.3-2.el7                         base    265 k
[00:00:51]  libicu                x86_64 50.1.2-17.el7                       base    6.9 M
[00:00:51]  libjpeg-turbo         x86_64 1.2.90-6.el7                        base    134 k
[00:00:51]  libkolab              x86_64 2.0-0.1.dev20150112.gitf0f953aa.el7 lbs-tbits.net-TBitsKolab16Test
[00:00:51]                                                                           301 k
[00:00:51]  libkolabxml           x86_64 1.2-0.20160909.git.el7              lbs-tbits.net-TBitsKolab16Test
[00:00:51]                                                                           630 k
[00:00:51]  libmng                x86_64 1.0.10-14.el7                       base    171 k
[00:00:51]  libpciaccess          x86_64 0.14-1.el7                          base     26 k
[00:00:51]  libpng                x86_64 2:1.5.13-7.el7_2                    base    213 k
[00:00:51]  libtiff               x86_64 4.0.3-27.el7_3                      base    170 k
[00:00:51]  libunistring          x86_64 0.9.3-9.el7                         base    293 k
[00:00:51]  libxcb                x86_64 1.13-1.el7                          base    214 k
[00:00:51]  libxshmfence          x86_64 1.2-1.el7                           base    7.2 k
[00:00:51]  m4                    x86_64 1.4.16-10.el7                       base    256 k
[00:00:51]  mariadb-libs          x86_64 1:5.5.60-1.el7_5                    base    758 k
[00:00:51]  mesa-libGL            x86_64 18.0.5-3.el7                        base    162 k
[00:00:51]  mesa-libglapi         x86_64 18.0.5-3.el7                        base     44 k
[00:00:51]  pciutils              x86_64 3.5.1-3.el7                         base     93 k
[00:00:51]  pciutils-libs         x86_64 3.5.1-3.el7                         base     46 k
[00:00:51]  pcre-devel            x86_64 8.32-17.el7                         base    480 k
[00:00:51]  perl-Data-Dumper      x86_64 2.145-3.el7                         base     47 k
[00:00:51]  perl-Error            noarch 1:0.17020-2.el7                     base     32 k
[00:00:51]  perl-Git              noarch 1.8.3.1-20.el7                      updates  55 k
[00:00:51]  perl-TermReadKey      x86_64 2.30-20.el7                         base     31 k
[00:00:51]  perl-Test-Harness     noarch 3.28-3.el7                          base    302 k
[00:00:51]  perl-XML-Parser       x86_64 2.41-10.el7                         base    223 k
[00:00:51]  pyOpenSSL             x86_64 0.13.1-4.el7                        base    135 k
[00:00:51]  pyserial              noarch 2.6-6.el7                           base    124 k
[00:00:51]  python-backports      x86_64 1.0-8.el7                           base    5.8 k
[00:00:51]  python-backports-ssl_match_hostname
[00:00:51]                        noarch 3.5.0.1-1.el7                       base     13 k
[00:00:51]  python-dateutil       noarch 1.5-7.el7                           base     85 k
[00:00:51]  python-ipaddress      noarch 1.0.16-2.el7                        base     34 k
[00:00:51]  python-setuptools     noarch 0.9.8-7.el7                         base    397 k
[00:00:51]  python-zope-interface x86_64 4.0.5-4.el7                         base    138 k
[00:00:51]  qt                    x86_64 1:4.8.7-2.el7                       base    4.6 M
[00:00:51]  qt-settings           noarch 19-23.8.el7.centos                  base     17 k
[00:00:51]  qt-x11                x86_64 1:4.8.7-2.el7                       base     13 M
[00:00:51]  xerces-c              x86_64 3.1.1-9.el7                         base    878 k
[00:00:51] 
[00:00:51] Transaction Summary
[00:00:51] ================================================================================
[00:00:51] Install  19 Packages (+74 Dependent packages)
[00:00:51] 
[00:00:51] Total size: 55 M
[00:00:51] Total download size: 5.0 M
[00:00:51] Installed size: 212 M
[00:00:51] Downloading packages:
[00:01:06] http://centos.mirror.net-d-sign.de/7.6.1810/os/x86_64/Packages/gettext-common-devel-0.19.8.1-2.el7.noarch.rpm: [Errno 14] curl#7 - "Failed to connect to 2a03:2cc0:1197::2c2a: Network is unreachable"
[00:01:06] Trying other mirror.
[00:01:06] http://centos.mirror.net-d-sign.de/7.6.1810/os/x86_64/Packages/gettext-devel-0.19.8.1-2.el7.x86_64.rpm: [Errno 14] curl#7 - "Failed to connect to 2a03:2cc0:1197::2c2a: Network is unreachable"
[00:01:06] Trying other mirror.
[00:01:06] warning: /var/cache/yum/x86_64/7/epel/packages/python-pep8-1.4.6-3.el7.noarch.rpm: Header V3 RSA/SHA256 Signature, key ID 352c64e5: NOKEY
[00:01:06] Public key for python-pep8-1.4.6-3.el7.noarch.rpm is not installed
[00:01:07] --------------------------------------------------------------------------------
[00:01:07] Total                                              316 kB/s | 5.0 MB  00:16     
[00:01:07] Retrieving key from file:///etc/pki/rpm-gpg/RPM-GPG-KEY-EPEL-7
[00:01:07] Importing GPG key 0x352C64E5:
[00:01:07]  Userid     : "Fedora EPEL (7) <epel@fedoraproject.org>"
[00:01:07]  Fingerprint: 91e9 7d7c 4a5e 96f1 7f3e 888f 6a2f aea2 352c 64e5
[00:01:07]  Package    : epel-release-7-11.noarch (@extras)
[00:01:07]  From       : /etc/pki/rpm-gpg/RPM-GPG-KEY-EPEL-7
[00:01:07] Key imported successfully
[00:01:07] Running transaction check
[00:01:07] Running transaction test
[00:01:07] Transaction test succeeded
[00:01:07] Running transaction
[00:01:07]   Installing : boost-system-1.53.0-27.el7.x86_64                           1/93 
[00:01:07]   Installing : boost-thread-1.53.0-27.el7.x86_64                           2/93 
[00:01:07]   Installing : xerces-c-3.1.1-9.el7.x86_64                                 3/93 
[00:01:08]   Installing : libkolabxml-1.2-0.20160909.git.el7.x86_64                   4/93 
[00:01:08]   Installing : libjpeg-turbo-1.2.90-6.el7.x86_64                           5/93 
[00:01:08]   Installing : 1:perl-Error-0.17020-2.el7.noarch                           6/93 
[00:01:08]   Installing : libcroco-0.6.12-4.el7.x86_64                                7/93 
[00:01:08]   Installing : fontpackages-filesystem-1.44-8.el7.noarch                   8/93 
[00:01:08]   Installing : libunistring-0.9.3-9.el7.x86_64                             9/93 
[00:01:08]   Installing : gettext-libs-0.19.8.1-2.el7.x86_64                         10/93 
[00:01:09]   Installing : hwdata-0.252-9.1.el7.x86_64                                11/93 
[00:01:09]   Installing : pytz-2016.10-2.el7.noarch                                  12/93 
[00:01:09]   Installing : libICE-1.0.9-9.el7.x86_64                                  13/93 
[00:01:09]   Installing : 2:libpng-1.5.13-7.el7_2.x86_64                             14/93 
[00:01:09]   Installing : freetype-2.8-12.el7.x86_64                                 15/93 
[00:01:09]   Installing : libSM-1.2.2-2.el7.x86_64                                   16/93 
[00:01:09]   Installing : libpciaccess-0.14-1.el7.x86_64                             17/93 
[00:01:09]   Installing : libdrm-2.4.91-3.el7.x86_64                                 18/93 
[00:01:09]   Installing : gettext-0.19.8.1-2.el7.x86_64                              19/93 
[00:01:09]   Installing : dejavu-fonts-common-2.33-6.el7.noarch                      20/93 
[00:01:09]   Installing : dejavu-sans-fonts-2.33-6.el7.noarch                        21/93 
[00:01:11]   Installing : fontconfig-2.13.0-4.3.el7.x86_64                           22/93 
[00:01:11]   Installing : libmng-1.0.10-14.el7.x86_64                                23/93 
[00:01:11]   Installing : python-kolabformat-1.2-0.20160909.git.el7.x86_64           24/93 
[00:01:11]   Installing : python2-pyasn1-0.1.9-7.el7.noarch                          25/93 
[00:01:11]   Installing : jbigkit-libs-2.0-11.el7.x86_64                             26/93 
[00:01:11]   Installing : libtiff-4.0.3-27.el7_3.x86_64                              27/93 
[00:01:11]   Installing : alsa-lib-1.1.6-2.el7.x86_64                                28/93 
[00:01:11]   Installing : pciutils-libs-3.5.1-3.el7.x86_64                           29/93 
[00:01:11]   Installing : pciutils-3.5.1-3.el7.x86_64                                30/93 
[00:01:12]   Installing : qt-settings-19-23.8.el7.centos.noarch                      31/93 
[00:01:12]   Installing : 1:qt-4.8.7-2.el7.x86_64                                    32/93 
[00:01:12]   Installing : less-458-9.el7.x86_64                                      33/93 
[00:01:12]   Installing : libxshmfence-1.2-1.el7.x86_64                              34/93 
[00:01:13]   Installing : pyOpenSSL-0.13.1-4.el7.x86_64                              35/93 
[00:01:13]   Installing : libicu-50.1.2-17.el7.x86_64                                36/93 
[00:01:13]   Installing : libical-3.0.3-2.el7.x86_64                                 37/93 
[00:01:13]   Installing : python-zope-interface-4.0.5-4.el7.x86_64                   38/93 
[00:01:13]   Installing : perl-Test-Harness-3.28-3.el7.noarch                        39/93 
[00:01:13]   Installing : python-dateutil-1.5-7.el7.noarch                           40/93 
[00:01:13]   Installing : m4-1.4.16-10.el7.x86_64                                    41/93 
[00:01:14]   Installing : pcre-devel-8.32-17.el7.x86_64                              42/93 
[00:01:14]   Installing : 1:mariadb-libs-5.5.60-1.el7_5.x86_64                       43/93 
[00:01:14]   Installing : libX11-common-1.6.5-2.el7.noarch                           44/93 
[00:01:14]   Installing : augeas-libs-1.4.0-6.el7.x86_64                             45/93 
[00:01:14]   Installing : mesa-libglapi-18.0.5-3.el7.x86_64                          46/93 
[00:01:14]   Installing : pyserial-2.6-6.el7.noarch                                  47/93 
[00:01:14]   Installing : perl-XML-Parser-2.41-10.el7.x86_64                         48/93 
[00:01:14]   Installing : python-ipaddress-1.0.16-2.el7.noarch                       49/93 
[00:01:14]   Installing : libXau-1.0.8-2.1.el7.x86_64                                50/93 
[00:01:14]   Installing : libxcb-1.13-1.el7.x86_64                                   51/93 
[00:01:14]   Installing : libX11-1.6.5-2.el7.x86_64                                  52/93 
[00:01:14]   Installing : libXext-1.3.3-3.el7.x86_64                                 53/93 
[00:01:14]   Installing : libXfixes-5.0.3-1.el7.x86_64                               54/93 
[00:01:14]   Installing : libXrender-0.9.10-1.el7.x86_64                             55/93 
[00:01:14]   Installing : libXcursor-1.1.15-1.el7.x86_64                             56/93 
[00:01:14]   Installing : libXrandr-1.5.1-2.el7.x86_64                               57/93 
[00:01:14]   Installing : libXdamage-1.1.4-4.1.el7.x86_64                            58/93 
[00:01:15]   Installing : libXi-1.7.9-1.el7.x86_64                                   59/93 
[00:01:15]   Installing : libXinerama-1.1.3-2.1.el7.x86_64                           60/93 
[00:01:15]   Installing : libXxf86vm-1.1.4-1.el7.x86_64                              61/93 
[00:01:15]   Installing : python-backports-1.0-8.el7.x86_64                          62/93 
[00:01:15]   Installing : python-backports-ssl_match_hostname-3.5.0.1-1.el7.noarch   63/93 
[00:01:15]   Installing : python-setuptools-0.9.8-7.el7.noarch                       64/93 
[00:01:15]   Installing : perl-Data-Dumper-2.145-3.el7.x86_64                        65/93 
[00:01:15]   Installing : autoconf-2.69-11.el7.noarch                                66/93 
[00:01:15]   Installing : automake-1.13.4-3.el7.noarch                               67/93 
[00:01:15]   Installing : 1:libglvnd-1.0.1-0.8.git5baa1e5.el7.x86_64                 68/93 
[00:01:15]   Installing : 1:libglvnd-glx-1.0.1-0.8.git5baa1e5.el7.x86_64             69/93 
[00:01:17]   Installing : mesa-libGL-18.0.5-3.el7.x86_64                             70/93 
[00:01:17]   Installing : 1:qt-x11-4.8.7-2.el7.x86_64                                71/93 
[00:01:18]   Installing : libcalendaring-4.9.2-0.20160905.git.el7.x86_64             72/93 
[00:01:18]   Installing : libkolab-2.0-0.1.dev20150112.gitf0f953aa.el7.x86_64        73/93 
[00:01:18]   Installing : gettext-common-devel-0.19.8.1-2.el7.noarch                 74/93 
[00:01:18]   Installing : perl-TermReadKey-2.30-20.el7.x86_64                        75/93 
[00:01:19]   Installing : perl-Git-1.8.3.1-20.el7.noarch                             76/93 
[00:01:19]   Installing : git-1.8.3.1-20.el7.x86_64                                  77/93 
[00:01:19]   Installing : gettext-devel-0.19.8.1-2.el7.x86_64                        78/93 
[00:01:19]   Installing : intltool-0.50.2-7.el7.noarch                               79/93 
[00:01:19]   Installing : python-kolab-2.0-0.1.dev20150112.gitf0f953aa.el7.x86_64    80/93 
[00:01:19]   Installing : python-pep8-1.4.6-3.el7.noarch                             81/93 
[00:01:20]   Installing : python-nose-1.3.7-1.el7.noarch                             82/93 
[00:01:20]   Installing : python-twisted-core-12.2.0-4.el7.x86_64                    83/93 
[00:01:20]   Installing : python-augeas-0.5.0-2.el7.noarch                           84/93 
[00:01:21]   Installing : MySQL-python-1.2.5-1.el7.x86_64                            85/93 
[00:01:21]   Installing : glib2-devel-2.56.1-2.el7.x86_64                            86/93 
[00:01:21]   Installing : python-icalendar-3.8.2-1.el7.noarch                        87/93 
[00:01:21]   Installing : python2-pyasn1-modules-0.1.9-7.el7.noarch                  88/93 
[00:01:21]   Installing : python-tzlocal-1.2-2.el7.noarch                            89/93 
[00:01:21]   Installing : python2-gnupg-0.4.3-1.el7.noarch                           90/93 
[00:01:22]   Installing : python-sqlalchemy-0.9.8-2.el7.x86_64                       91/93 
[00:01:22]   Installing : python-ldap-2.4.15-2.el7.x86_64                            92/93 
[00:01:22]   Installing : python-sievelib-0.5.2-2.el7.noarch                         93/93 
[00:01:22]   Verifying  : libXext-1.3.3-3.el7.x86_64                                  1/93 
[00:01:22]   Verifying  : libXi-1.7.9-1.el7.x86_64                                    2/93 
[00:01:22]   Verifying  : libXrender-0.9.10-1.el7.x86_64                              3/93 
[00:01:22]   Verifying  : MySQL-python-1.2.5-1.el7.x86_64                             4/93 
[00:01:22]   Verifying  : 2:libpng-1.5.13-7.el7_2.x86_64                              5/93 
[00:01:22]   Verifying  : libcalendaring-4.9.2-0.20160905.git.el7.x86_64              6/93 
[00:01:22]   Verifying  : freetype-2.8-12.el7.x86_64                                  7/93 
[00:01:22]   Verifying  : perl-TermReadKey-2.30-20.el7.x86_64                         8/93 
[00:01:22]   Verifying  : libdrm-2.4.91-3.el7.x86_64                                  9/93 
[00:01:22]   Verifying  : gettext-0.19.8.1-2.el7.x86_64                              10/93 
[00:01:22]   Verifying  : perl-Git-1.8.3.1-20.el7.noarch                             11/93 
[00:01:22]   Verifying  : python-sievelib-0.5.2-2.el7.noarch                         12/93 
[00:01:22]   Verifying  : gettext-common-devel-0.19.8.1-2.el7.noarch                 13/93 
[00:01:22]   Verifying  : 1:libglvnd-1.0.1-0.8.git5baa1e5.el7.x86_64                 14/93 
[00:01:22]   Verifying  : perl-Data-Dumper-2.145-3.el7.x86_64                        15/93 
[00:01:22]   Verifying  : git-1.8.3.1-20.el7.x86_64                                  16/93 
[00:01:22]   Verifying  : python-backports-1.0-8.el7.x86_64                          17/93 
[00:01:22]   Verifying  : 1:libglvnd-glx-1.0.1-0.8.git5baa1e5.el7.x86_64             18/93 
[00:01:22]   Verifying  : dejavu-sans-fonts-2.33-6.el7.noarch                        19/93 
[00:01:22]   Verifying  : python-tzlocal-1.2-2.el7.noarch                            20/93 
[00:01:22]   Verifying  : autoconf-2.69-11.el7.noarch                                21/93 
[00:01:22]   Verifying  : libXau-1.0.8-2.1.el7.x86_64                                22/93 
[00:01:22]   Verifying  : python-ipaddress-1.0.16-2.el7.noarch                       23/93 
[00:01:22]   Verifying  : pciutils-3.5.1-3.el7.x86_64                                24/93 
[00:01:22]   Verifying  : python-augeas-0.5.0-2.el7.noarch                           25/93 
[00:01:22]   Verifying  : libpciaccess-0.14-1.el7.x86_64                             26/93 
[00:01:22]   Verifying  : python-pep8-1.4.6-3.el7.noarch                             27/93 
[00:01:22]   Verifying  : libICE-1.0.9-9.el7.x86_64                                  28/93 
[00:01:22]   Verifying  : 1:qt-4.8.7-2.el7.x86_64                                    29/93 
[00:01:22]   Verifying  : perl-XML-Parser-2.41-10.el7.x86_64                         30/93 
[00:01:22]   Verifying  : python-setuptools-0.9.8-7.el7.noarch                       31/93 
[00:01:22]   Verifying  : pyserial-2.6-6.el7.noarch                                  32/93 
[00:01:22]   Verifying  : pytz-2016.10-2.el7.noarch                                  33/93 
[00:01:22]   Verifying  : hwdata-0.252-9.1.el7.x86_64                                34/93 
[00:01:22]   Verifying  : mesa-libglapi-18.0.5-3.el7.x86_64                          35/93 
[00:01:22]   Verifying  : python-ldap-2.4.15-2.el7.x86_64                            36/93 
[00:01:22]   Verifying  : augeas-libs-1.4.0-6.el7.x86_64                             37/93 
[00:01:22]   Verifying  : libkolab-2.0-0.1.dev20150112.gitf0f953aa.el7.x86_64        38/93 
[00:01:22]   Verifying  : python2-pyasn1-modules-0.1.9-7.el7.noarch                  39/93 
[00:01:22]   Verifying  : libX11-common-1.6.5-2.el7.noarch                           40/93 
[00:01:22]   Verifying  : libXfixes-5.0.3-1.el7.x86_64                               41/93 
[00:01:22]   Verifying  : 1:qt-x11-4.8.7-2.el7.x86_64                                42/93 
[00:01:22]   Verifying  : libtiff-4.0.3-27.el7_3.x86_64                              43/93 
[00:01:22]   Verifying  : fontconfig-2.13.0-4.3.el7.x86_64                           44/93 
[00:01:22]   Verifying  : python-backports-ssl_match_hostname-3.5.0.1-1.el7.noarch   45/93 
[00:01:22]   Verifying  : python-kolabformat-1.2-0.20160909.git.el7.x86_64           46/93 
[00:01:22]   Verifying  : boost-system-1.53.0-27.el7.x86_64                          47/93 
[00:01:22]   Verifying  : 1:mariadb-libs-5.5.60-1.el7_5.x86_64                       48/93 
[00:01:22]   Verifying  : libunistring-0.9.3-9.el7.x86_64                            49/93 
[00:01:22]   Verifying  : pcre-devel-8.32-17.el7.x86_64                              50/93 
[00:01:22]   Verifying  : libXcursor-1.1.15-1.el7.x86_64                             51/93 
[00:01:22]   Verifying  : mesa-libGL-18.0.5-3.el7.x86_64                             52/93 
[00:01:22]   Verifying  : m4-1.4.16-10.el7.x86_64                                    53/93 
[00:01:22]   Verifying  : fontpackages-filesystem-1.44-8.el7.noarch                  54/93 
[00:01:22]   Verifying  : gettext-libs-0.19.8.1-2.el7.x86_64                         55/93 
[00:01:22]   Verifying  : libical-3.0.3-2.el7.x86_64                                 56/93 
[00:01:22]   Verifying  : libjpeg-turbo-1.2.90-6.el7.x86_64                          57/93 
[00:01:22]   Verifying  : libcroco-0.6.12-4.el7.x86_64                               58/93 
[00:01:22]   Verifying  : python-dateutil-1.5-7.el7.noarch                           59/93 
[00:01:22]   Verifying  : perl-Test-Harness-3.28-3.el7.noarch                        60/93 
[00:01:22]   Verifying  : python-zope-interface-4.0.5-4.el7.x86_64                   61/93 
[00:01:22]   Verifying  : glib2-devel-2.56.1-2.el7.x86_64                            62/93 
[00:01:22]   Verifying  : python-sqlalchemy-0.9.8-2.el7.x86_64                       63/93 
[00:01:22]   Verifying  : boost-thread-1.53.0-27.el7.x86_64                          64/93 
[00:01:22]   Verifying  : libicu-50.1.2-17.el7.x86_64                                65/93 
[00:01:22]   Verifying  : python-kolab-2.0-0.1.dev20150112.gitf0f953aa.el7.x86_64    66/93 
[00:01:22]   Verifying  : libXrandr-1.5.1-2.el7.x86_64                               67/93 
[00:01:22]   Verifying  : pyOpenSSL-0.13.1-4.el7.x86_64                              68/93 
[00:01:22]   Verifying  : libxshmfence-1.2-1.el7.x86_64                              69/93 
[00:01:22]   Verifying  : libSM-1.2.2-2.el7.x86_64                                   70/93 
[00:01:22]   Verifying  : python-icalendar-3.8.2-1.el7.noarch                        71/93 
[00:01:22]   Verifying  : python-twisted-core-12.2.0-4.el7.x86_64                    72/93 
[00:01:22]   Verifying  : libXdamage-1.1.4-4.1.el7.x86_64                            73/93 
[00:01:22]   Verifying  : less-458-9.el7.x86_64                                      74/93 
[00:01:22]   Verifying  : gettext-devel-0.19.8.1-2.el7.x86_64                        75/93 
[00:01:22]   Verifying  : libXinerama-1.1.3-2.1.el7.x86_64                           76/93 
[00:01:22]   Verifying  : xerces-c-3.1.1-9.el7.x86_64                                77/93 
[00:01:22]   Verifying  : libXxf86vm-1.1.4-1.el7.x86_64                              78/93 
[00:01:22]   Verifying  : qt-settings-19-23.8.el7.centos.noarch                      79/93 
[00:01:22]   Verifying  : pciutils-libs-3.5.1-3.el7.x86_64                           80/93 
[00:01:22]   Verifying  : python-nose-1.3.7-1.el7.noarch                             81/93 
[00:01:22]   Verifying  : dejavu-fonts-common-2.33-6.el7.noarch                      82/93 
[00:01:22]   Verifying  : alsa-lib-1.1.6-2.el7.x86_64                                83/93 
[00:01:22]   Verifying  : intltool-0.50.2-7.el7.noarch                               84/93 
[00:01:22]   Verifying  : libxcb-1.13-1.el7.x86_64                                   85/93 
[00:01:22]   Verifying  : libmng-1.0.10-14.el7.x86_64                                86/93 
[00:01:22]   Verifying  : python2-gnupg-0.4.3-1.el7.noarch                           87/93 
[00:01:22]   Verifying  : 1:perl-Error-0.17020-2.el7.noarch                          88/93 
[00:01:22]   Verifying  : libX11-1.6.5-2.el7.x86_64                                  89/93 
[00:01:22]   Verifying  : jbigkit-libs-2.0-11.el7.x86_64                             90/93 
[00:01:22]   Verifying  : automake-1.13.4-3.el7.noarch                               91/93 
[00:01:22]   Verifying  : libkolabxml-1.2-0.20160909.git.el7.x86_64                  92/93 
[00:01:23]   Verifying  : python2-pyasn1-0.1.9-7.el7.noarch                          93/93 
[00:01:23] 
[00:01:23] Installed:
[00:01:23]   MySQL-python.x86_64 0:1.2.5-1.el7                                             
[00:01:23]   gettext.x86_64 0:0.19.8.1-2.el7                                               
[00:01:23]   glib2-devel.x86_64 0:2.56.1-2.el7                                             
[00:01:23]   intltool.noarch 0:0.50.2-7.el7                                                
[00:01:23]   python-augeas.noarch 0:0.5.0-2.el7                                            
[00:01:23]   python-icalendar.noarch 0:3.8.2-1.el7                                         
[00:01:23]   python-kolab.x86_64 0:2.0-0.1.dev20150112.gitf0f953aa.el7                     
[00:01:23]   python-kolabformat.x86_64 0:1.2-0.20160909.git.el7                            
[00:01:23]   python-ldap.x86_64 0:2.4.15-2.el7                                             
[00:01:23]   python-nose.noarch 0:1.3.7-1.el7                                              
[00:01:23]   python-pep8.noarch 0:1.4.6-3.el7                                              
[00:01:23]   python-sievelib.noarch 0:0.5.2-2.el7                                          
[00:01:23]   python-sqlalchemy.x86_64 0:0.9.8-2.el7                                        
[00:01:23]   python-twisted-core.x86_64 0:12.2.0-4.el7                                     
[00:01:23]   python-tzlocal.noarch 0:1.2-2.el7                                             
[00:01:23]   python2-gnupg.noarch 0:0.4.3-1.el7                                            
[00:01:23]   python2-pyasn1.noarch 0:0.1.9-7.el7                                           
[00:01:23]   python2-pyasn1-modules.noarch 0:0.1.9-7.el7                                   
[00:01:23]   pytz.noarch 0:2016.10-2.el7                                                   
[00:01:23] 
[00:01:23] Dependency Installed:
[00:01:23]   alsa-lib.x86_64 0:1.1.6-2.el7                                                 
[00:01:23]   augeas-libs.x86_64 0:1.4.0-6.el7                                              
[00:01:23]   autoconf.noarch 0:2.69-11.el7                                                 
[00:01:23]   automake.noarch 0:1.13.4-3.el7                                                
[00:01:23]   boost-system.x86_64 0:1.53.0-27.el7                                           
[00:01:23]   boost-thread.x86_64 0:1.53.0-27.el7                                           
[00:01:23]   dejavu-fonts-common.noarch 0:2.33-6.el7                                       
[00:01:23]   dejavu-sans-fonts.noarch 0:2.33-6.el7                                         
[00:01:23]   fontconfig.x86_64 0:2.13.0-4.3.el7                                            
[00:01:23]   fontpackages-filesystem.noarch 0:1.44-8.el7                                   
[00:01:23]   freetype.x86_64 0:2.8-12.el7                                                  
[00:01:23]   gettext-common-devel.noarch 0:0.19.8.1-2.el7                                  
[00:01:23]   gettext-devel.x86_64 0:0.19.8.1-2.el7                                         
[00:01:23]   gettext-libs.x86_64 0:0.19.8.1-2.el7                                          
[00:01:23]   git.x86_64 0:1.8.3.1-20.el7                                                   
[00:01:23]   hwdata.x86_64 0:0.252-9.1.el7                                                 
[00:01:23]   jbigkit-libs.x86_64 0:2.0-11.el7                                              
[00:01:23]   less.x86_64 0:458-9.el7                                                       
[00:01:23]   libICE.x86_64 0:1.0.9-9.el7                                                   
[00:01:23]   libSM.x86_64 0:1.2.2-2.el7                                                    
[00:01:23]   libX11.x86_64 0:1.6.5-2.el7                                                   
[00:01:23]   libX11-common.noarch 0:1.6.5-2.el7                                            
[00:01:23]   libXau.x86_64 0:1.0.8-2.1.el7                                                 
[00:01:23]   libXcursor.x86_64 0:1.1.15-1.el7                                              
[00:01:23]   libXdamage.x86_64 0:1.1.4-4.1.el7                                             
[00:01:23]   libXext.x86_64 0:1.3.3-3.el7                                                  
[00:01:23]   libXfixes.x86_64 0:5.0.3-1.el7                                                
[00:01:23]   libXi.x86_64 0:1.7.9-1.el7                                                    
[00:01:23]   libXinerama.x86_64 0:1.1.3-2.1.el7                                            
[00:01:23]   libXrandr.x86_64 0:1.5.1-2.el7                                                
[00:01:23]   libXrender.x86_64 0:0.9.10-1.el7                                              
[00:01:23]   libXxf86vm.x86_64 0:1.1.4-1.el7                                               
[00:01:23]   libcalendaring.x86_64 0:4.9.2-0.20160905.git.el7                              
[00:01:23]   libcroco.x86_64 0:0.6.12-4.el7                                                
[00:01:23]   libdrm.x86_64 0:2.4.91-3.el7                                                  
[00:01:23]   libglvnd.x86_64 1:1.0.1-0.8.git5baa1e5.el7                                    
[00:01:23]   libglvnd-glx.x86_64 1:1.0.1-0.8.git5baa1e5.el7                                
[00:01:23]   libical.x86_64 0:3.0.3-2.el7                                                  
[00:01:23]   libicu.x86_64 0:50.1.2-17.el7                                                 
[00:01:23]   libjpeg-turbo.x86_64 0:1.2.90-6.el7                                           
[00:01:23]   libkolab.x86_64 0:2.0-0.1.dev20150112.gitf0f953aa.el7                         
[00:01:23]   libkolabxml.x86_64 0:1.2-0.20160909.git.el7                                   
[00:01:23]   libmng.x86_64 0:1.0.10-14.el7                                                 
[00:01:23]   libpciaccess.x86_64 0:0.14-1.el7                                              
[00:01:23]   libpng.x86_64 2:1.5.13-7.el7_2                                                
[00:01:23]   libtiff.x86_64 0:4.0.3-27.el7_3                                               
[00:01:23]   libunistring.x86_64 0:0.9.3-9.el7                                             
[00:01:23]   libxcb.x86_64 0:1.13-1.el7                                                    
[00:01:23]   libxshmfence.x86_64 0:1.2-1.el7                                               
[00:01:23]   m4.x86_64 0:1.4.16-10.el7                                                     
[00:01:23]   mariadb-libs.x86_64 1:5.5.60-1.el7_5                                          
[00:01:23]   mesa-libGL.x86_64 0:18.0.5-3.el7                                              
[00:01:23]   mesa-libglapi.x86_64 0:18.0.5-3.el7                                           
[00:01:23]   pciutils.x86_64 0:3.5.1-3.el7                                                 
[00:01:23]   pciutils-libs.x86_64 0:3.5.1-3.el7                                            
[00:01:23]   pcre-devel.x86_64 0:8.32-17.el7                                               
[00:01:23]   perl-Data-Dumper.x86_64 0:2.145-3.el7                                         
[00:01:23]   perl-Error.noarch 1:0.17020-2.el7                                             
[00:01:23]   perl-Git.noarch 0:1.8.3.1-20.el7                                              
[00:01:23]   perl-TermReadKey.x86_64 0:2.30-20.el7                                         
[00:01:23]   perl-Test-Harness.noarch 0:3.28-3.el7                                         
[00:01:23]   perl-XML-Parser.x86_64 0:2.41-10.el7                                          
[00:01:23]   pyOpenSSL.x86_64 0:0.13.1-4.el7                                               
[00:01:23]   pyserial.noarch 0:2.6-6.el7                                                   
[00:01:23]   python-backports.x86_64 0:1.0-8.el7                                           
[00:01:23]   python-backports-ssl_match_hostname.noarch 0:3.5.0.1-1.el7                    
[00:01:23]   python-dateutil.noarch 0:1.5-7.el7                                            
[00:01:23]   python-ipaddress.noarch 0:1.0.16-2.el7                                        
[00:01:23]   python-setuptools.noarch 0:0.9.8-7.el7                                        
[00:01:23]   python-zope-interface.x86_64 0:4.0.5-4.el7                                    
[00:01:23]   qt.x86_64 1:4.8.7-2.el7                                                       
[00:01:23]   qt-settings.noarch 0:19-23.8.el7.centos                                       
[00:01:23]   qt-x11.x86_64 1:4.8.7-2.el7                                                   
[00:01:23]   xerces-c.x86_64 0:3.1.1-9.el7                                                 
[00:01:23] 
[00:01:23] Complete!
[00:01:23] 0
[00:01:23] now running: ssh -f -o "StrictHostKeyChecking no" -o Port=22 -i /etc/lightbuildserver/container/container_rsa root@10.0.3.5 "export LC_ALL=C; (mydevice=\`ip -o route get to 8.8.8.8 | awk '{ print \$5 }'\`; myip=\`ip -o route get to 8.8.8.8 | awk '{ print \$7 }'\`; ip route add \$myip dev \$mydevice) 2>&1 && echo \$?"
[00:01:23] 0
[00:01:23] now running: ssh -f -o "StrictHostKeyChecking no" -o Port=22 -i /etc/lightbuildserver/container/container_rsa root@10.0.3.5 "export LC_ALL=C; (sed -i "s/0%{?suse_version}/0/g" lbs-TBitsKolab16Test/pykolab/pykolab.spec) 2>&1 && echo \$?"
[00:01:23] 0
[00:01:23] now running: ssh -f -o "StrictHostKeyChecking no" -o Port=22 -i /etc/lightbuildserver/container/container_rsa root@10.0.3.5 "export LC_ALL=C; (cp lbs-TBitsKolab16Test/pykolab/pykolab.spec rpmbuild/SPECS) 2>&1 && echo \$?"
[00:01:23] 0
[00:01:23] now running: ssh -f -o "StrictHostKeyChecking no" -o Port=22 -i /etc/lightbuildserver/container/container_rsa root@10.0.3.5 "export LC_ALL=C; (cp lbs-TBitsKolab16Test/pykolab/* rpmbuild/SOURCES) 2>&1 && echo \$?"
[00:01:23] 0
[00:01:23] now running: ssh -f -o "StrictHostKeyChecking no" -o Port=22 -i /etc/lightbuildserver/container/container_rsa root@10.0.3.5 "export LC_ALL=C; (mv sources/* rpmbuild/SOURCES) 2>&1 && echo \$?"
[00:01:23] mv: cannot stat 'sources/*': No such file or directory
[00:01:23] now running: rsync -avz -e "ssh -i /etc/lightbuildserver/container/container_rsa -p 2222" root@build04lxc.lbs.solidcharity.com:/var/lib/lxc/005-build04lxc.lbs.solidcharity.com/rootfs/root/rpmbuild/SPECS/pykolab.spec /tmp/tmp5sjlg2_i
[00:01:24] receiving incremental file list
[00:01:24] pykolab.spec
[00:01:24] 
[00:01:24] sent 43 bytes  received 5,908 bytes  11,902.00 bytes/sec
[00:01:24] total size is 25,556  speedup is 4.29
[00:01:24] now running: ssh -f -o "StrictHostKeyChecking no" -o Port=22 -i /etc/lightbuildserver/container/container_rsa root@10.0.3.5 "export LC_ALL=C; (sed -i -e 's/Release:.*%{release}/Release: 0/g' rpmbuild/SPECS/pykolab.spec) 2>&1 && echo \$?"
[00:01:24] 0
[00:01:24] now running: ssh -f -o "StrictHostKeyChecking no" -o Port=22 -i /etc/lightbuildserver/container/container_rsa root@10.0.3.5 "export LC_ALL=C; (rpmbuild -ba rpmbuild/SPECS/pykolab.spec) 2>&1 && echo \$?"
[00:01:25] Executing(%prep): /bin/sh -e /var/tmp/rpm-tmp.VWY1Te
[00:01:25] + umask 022
[00:01:25] + cd /root/rpmbuild/BUILD
[00:01:25] + cd /root/rpmbuild/BUILD
[00:01:25] + rm -rf pykolab-0.8.9
[00:01:25] + /usr/bin/gzip -dc /root/rpmbuild/SOURCES/pykolab-0.8.9.tar.gz
[00:01:25] + /usr/bin/tar -xf -
[00:01:25] + STATUS=0
[00:01:25] + '[' 0 -ne 0 ']'
[00:01:25] + cd pykolab-0.8.9
[00:01:25] + /usr/bin/chmod -Rf a+rX,u+w,g-w,o-w .
[00:01:25] + echo 'Patch #8 (pykolab_do_not_rename_existing_mailbox_T3315.patch):'
[00:01:25] Patch #8 (pykolab_do_not_rename_existing_mailbox_T3315.patch):
[00:01:25] + /usr/bin/cat /root/rpmbuild/SOURCES/pykolab_do_not_rename_existing_mailbox_T3315.patch
[00:01:25] + /usr/bin/patch -p1 --fuzz=0
[00:01:25] patching file pykolab/auth/ldap/__init__.py
[00:01:25] Hunk #1 succeeded at 1901 (offset 42 lines).
[00:01:25] Hunk #2 succeeded at 2051 (offset 42 lines).
[00:01:25] Hunk #3 succeeded at 2064 (offset 42 lines).
[00:01:25] Hunk #4 succeeded at 2230 (offset 37 lines).
[00:01:25] + echo 'Patch #9 (lastLoginTBitsAttribute-pykolab.patch):'
[00:01:25] Patch #9 (lastLoginTBitsAttribute-pykolab.patch):
[00:01:25] + /usr/bin/cat /root/rpmbuild/SOURCES/lastLoginTBitsAttribute-pykolab.patch
[00:01:25] + /usr/bin/patch -p1 --fuzz=0
[00:01:25] patching file pykolab/auth/ldap/__init__.py
[00:01:25] Hunk #1 succeeded at 339 (offset 4 lines).
[00:01:25] Hunk #2 succeeded at 388 (offset 4 lines).
[00:01:25] patching file pykolab/auth/ldap/auth_cache.py
[00:01:25] Hunk #1 succeeded at 55 (offset 2 lines).
[00:01:25] Hunk #2 succeeded at 150 (offset -1 lines).
[00:01:25] Hunk #3 succeeded at 160 (offset -1 lines).
[00:01:25] + echo 'Patch #10 (allowPrimaryEmailAddressFromDomain.patch):'
[00:01:25] Patch #10 (allowPrimaryEmailAddressFromDomain.patch):
[00:01:25] + /usr/bin/cat /root/rpmbuild/SOURCES/allowPrimaryEmailAddressFromDomain.patch
[00:01:25] + /usr/bin/patch -p1 --fuzz=0
[00:01:25] patching file pykolab/auth/ldap/__init__.py
[00:01:25] Hunk #1 succeeded at 982 (offset 311 lines).
[00:01:25] + echo 'Patch #11 (canonification_via_uid_pykolab.patch):'
[00:01:25] Patch #11 (canonification_via_uid_pykolab.patch):
[00:01:25] + /usr/bin/cat /root/rpmbuild/SOURCES/canonification_via_uid_pykolab.patch
[00:01:25] + /usr/bin/patch -p1 --fuzz=0
[00:01:25] patching file pykolab/auth/ldap/__init__.py
[00:01:25] Hunk #2 succeeded at 141 (offset 2 lines).
[00:01:25] patching file pykolab/wap_client/__init__.py
[00:01:25] + echo 'Patch #12 (logLoginData.patch):'
[00:01:25] Patch #12 (logLoginData.patch):
[00:01:25] + /usr/bin/cat /root/rpmbuild/SOURCES/logLoginData.patch
[00:01:25] + /usr/bin/patch -p1 --fuzz=0
[00:01:25] patching file pykolab/auth/ldap/__init__.py
[00:01:25] Hunk #2 succeeded at 229 (offset -1 lines).
[00:01:25] Hunk #3 succeeded at 456 (offset 20 lines).
[00:01:25] + echo 'Patch #13 (disableSpamFilter.patch):'
[00:01:25] Patch #13 (disableSpamFilter.patch):
[00:01:25] + /usr/bin/cat /root/rpmbuild/SOURCES/disableSpamFilter.patch
[00:01:25] + /usr/bin/patch -p1 --fuzz=0
[00:01:25] patching file pykolab/setup/setup_mta.py
[00:01:25] + echo 'Patch #14 (disableSpamFilter2.patch):'
[00:01:25] Patch #14 (disableSpamFilter2.patch):
[00:01:25] + /usr/bin/cat /root/rpmbuild/SOURCES/disableSpamFilter2.patch
[00:01:25] + /usr/bin/patch -p1 --fuzz=0
[00:01:25] patching file share/templates/master.cf.tpl
[00:01:25] + echo 'Patch #15 (fixPykolabIMAPKeepAlive.patch):'
[00:01:25] Patch #15 (fixPykolabIMAPKeepAlive.patch):
[00:01:25] + /usr/bin/patch -p1 --fuzz=0
[00:01:25] + /usr/bin/cat /root/rpmbuild/SOURCES/fixPykolabIMAPKeepAlive.patch
[00:01:25] patching file pykolab/imap/__init__.py
[00:01:25] Hunk #1 succeeded at 875 (offset 27 lines).
[00:01:25] + echo 'Patch #16 (onlyAllowKolabUsersToAuthViaSasl.patch):'
[00:01:25] Patch #16 (onlyAllowKolabUsersToAuthViaSasl.patch):
[00:01:25] + /usr/bin/cat /root/rpmbuild/SOURCES/onlyAllowKolabUsersToAuthViaSasl.patch
[00:01:25] + /usr/bin/patch -p1 --fuzz=0
[00:01:25] patching file pykolab/auth/ldap/__init__.py
[00:01:25] Hunk #1 succeeded at 201 (offset 3 lines).
[00:01:25] + echo 'Patch #17 (pykolab_wap_client_unverified_context_localhost.patch):'
[00:01:25] Patch #17 (pykolab_wap_client_unverified_context_localhost.patch):
[00:01:25] + /usr/bin/cat /root/rpmbuild/SOURCES/pykolab_wap_client_unverified_context_localhost.patch
[00:01:25] + /usr/bin/patch -p1 --fuzz=0
[00:01:25] patching file pykolab/wap_client/__init__.py
[00:01:25] + echo 'Patch #18 (kolab_lam_invalid_mailbox_name.patch):'
[00:01:25] Patch #18 (kolab_lam_invalid_mailbox_name.patch):
[00:01:25] + /usr/bin/patch -p1 --fuzz=0
[00:01:25] + /usr/bin/cat /root/rpmbuild/SOURCES/kolab_lam_invalid_mailbox_name.patch
[00:01:25] patching file cyruslib.py
[00:01:25] + echo 'Patch #19 (pykolab_no_guam.patch):'
[00:01:25] Patch #19 (pykolab_no_guam.patch):
[00:01:25] + /usr/bin/patch -p1 --fuzz=0
[00:01:25] + /usr/bin/cat /root/rpmbuild/SOURCES/pykolab_no_guam.patch
[00:01:25] patching file share/templates/cyrus.conf.tpl
[00:01:25] + exit 0
[00:01:25] Executing(%build): /bin/sh -e /var/tmp/rpm-tmp.u6rDDX
[00:01:25] + umask 022
[00:01:25] + cd /root/rpmbuild/BUILD
[00:01:25] + cd pykolab-0.8.9
[00:01:25] + autoreconf -v
[00:01:25] autoreconf: Entering directory `.'
[00:01:25] autoreconf: configure.ac: not using Gettext
[00:01:26] autoreconf: running: aclocal 
[00:01:27] autoreconf: configure.ac: tracing
[00:01:27] autoreconf: configure.ac: not using Libtool
[00:01:27] autoreconf: running: /usr/bin/autoconf
[00:01:28] autoreconf: configure.ac: not using Autoheader
[00:01:28] autoreconf: running: automake --no-force
[00:01:28] Makefile.am:23: warning: wildcard tests/*.py: non-POSIX variable name
[00:01:28] Makefile.am:23: (probably a GNU make extension)
[00:01:28] Makefile.am:23: warning: wildcard tests/*/*.py: non-POSIX variable name
[00:01:28] Makefile.am:23: (probably a GNU make extension)
[00:01:28] Makefile.am:23: warning: wildcard tests/*/*/*.py: non-POSIX variable name
[00:01:28] Makefile.am:23: (probably a GNU make extension)
[00:01:28] kolabd/Makefile.am:8: warning: wildcard *.py: non-POSIX variable name
[00:01:28] kolabd/Makefile.am:8: (probably a GNU make extension)
[00:01:28] pykolab/Makefile.am:2: warning: wildcard *.py: non-POSIX variable name
[00:01:28] pykolab/Makefile.am:2: (probably a GNU make extension)
[00:01:28] pykolab/Makefile.am:16: warning: wildcard cli/*.py: non-POSIX variable name
[00:01:28] pykolab/Makefile.am:16: (probably a GNU make extension)
[00:01:28] pykolab/Makefile.am:20: warning: wildcard cli/sieve/*.py: non-POSIX variable name
[00:01:28] pykolab/Makefile.am:20: (probably a GNU make extension)
[00:01:28] pykolab/Makefile.am:24: warning: wildcard cli/telemetry/*.py: non-POSIX variable name
[00:01:28] pykolab/Makefile.am:24: (probably a GNU make extension)
[00:01:28] pykolab/Makefile.am:28: warning: wildcard cli/wap/*.py: non-POSIX variable name
[00:01:28] pykolab/Makefile.am:28: (probably a GNU make extension)
[00:01:28] pykolab/Makefile.am:87: warning: wildcard wap_client/*.py: non-POSIX variable name
[00:01:28] pykolab/Makefile.am:87: (probably a GNU make extension)
[00:01:28] pykolab/Makefile.am:91: warning: wildcard xml/*.py: non-POSIX variable name
[00:01:28] pykolab/Makefile.am:91: (probably a GNU make extension)
[00:01:28] saslauthd/Makefile.am:7: warning: wildcard *.py: non-POSIX variable name
[00:01:28] saslauthd/Makefile.am:7: (probably a GNU make extension)
[00:01:28] share/Makefile.am:2: warning: wildcard templates/*.tpl: non-POSIX variable name
[00:01:28] share/Makefile.am:2: (probably a GNU make extension)
[00:01:28] share/Makefile.am:2: warning: wildcard templates/header_checks.*: non-POSIX variable name
[00:01:28] share/Makefile.am:2: (probably a GNU make extension)
[00:01:28] share/Makefile.am:7: warning: wildcard templates/roundcubemail/*.tpl: non-POSIX variable name
[00:01:28] share/Makefile.am:7: (probably a GNU make extension)
[00:01:29] wallace/Makefile.am:8: warning: wildcard module_*.py: non-POSIX variable name
[00:01:29] wallace/Makefile.am:8: (probably a GNU make extension)
[00:01:29] autoreconf: Leaving directory `.'
[00:01:29] + autoreconf -v
[00:01:29] autoreconf: Entering directory `.'
[00:01:29] autoreconf: configure.ac: not using Gettext
[00:01:30] autoreconf: running: aclocal 
[00:01:30] autoreconf: configure.ac: tracing
[00:01:30] autoreconf: configure.ac: not using Libtool
[00:01:30] autoreconf: running: /usr/bin/autoconf
[00:01:31] autoreconf: configure.ac: not using Autoheader
[00:01:31] autoreconf: running: automake --no-force
[00:01:31] Makefile.am:23: warning: wildcard tests/*.py: non-POSIX variable name
[00:01:31] Makefile.am:23: (probably a GNU make extension)
[00:01:31] Makefile.am:23: warning: wildcard tests/*/*.py: non-POSIX variable name
[00:01:31] Makefile.am:23: (probably a GNU make extension)
[00:01:31] Makefile.am:23: warning: wildcard tests/*/*/*.py: non-POSIX variable name
[00:01:31] Makefile.am:23: (probably a GNU make extension)
[00:01:31] kolabd/Makefile.am:8: warning: wildcard *.py: non-POSIX variable name
[00:01:31] kolabd/Makefile.am:8: (probably a GNU make extension)
[00:01:31] pykolab/Makefile.am:2: warning: wildcard *.py: non-POSIX variable name
[00:01:31] pykolab/Makefile.am:2: (probably a GNU make extension)
[00:01:31] pykolab/Makefile.am:16: warning: wildcard cli/*.py: non-POSIX variable name
[00:01:31] pykolab/Makefile.am:16: (probably a GNU make extension)
[00:01:31] pykolab/Makefile.am:20: warning: wildcard cli/sieve/*.py: non-POSIX variable name
[00:01:31] pykolab/Makefile.am:20: (probably a GNU make extension)
[00:01:31] pykolab/Makefile.am:24: warning: wildcard cli/telemetry/*.py: non-POSIX variable name
[00:01:31] pykolab/Makefile.am:24: (probably a GNU make extension)
[00:01:31] pykolab/Makefile.am:28: warning: wildcard cli/wap/*.py: non-POSIX variable name
[00:01:31] pykolab/Makefile.am:28: (probably a GNU make extension)
[00:01:31] pykolab/Makefile.am:87: warning: wildcard wap_client/*.py: non-POSIX variable name
[00:01:31] pykolab/Makefile.am:87: (probably a GNU make extension)
[00:01:31] pykolab/Makefile.am:91: warning: wildcard xml/*.py: non-POSIX variable name
[00:01:31] pykolab/Makefile.am:91: (probably a GNU make extension)
[00:01:31] saslauthd/Makefile.am:7: warning: wildcard *.py: non-POSIX variable name
[00:01:31] saslauthd/Makefile.am:7: (probably a GNU make extension)
[00:01:31] share/Makefile.am:2: warning: wildcard templates/*.tpl: non-POSIX variable name
[00:01:31] share/Makefile.am:2: (probably a GNU make extension)
[00:01:31] share/Makefile.am:2: warning: wildcard templates/header_checks.*: non-POSIX variable name
[00:01:31] share/Makefile.am:2: (probably a GNU make extension)
[00:01:31] share/Makefile.am:7: warning: wildcard templates/roundcubemail/*.tpl: non-POSIX variable name
[00:01:31] share/Makefile.am:7: (probably a GNU make extension)
[00:01:31] wallace/Makefile.am:8: warning: wildcard module_*.py: non-POSIX variable name
[00:01:31] wallace/Makefile.am:8: (probably a GNU make extension)
[00:01:32] autoreconf: Leaving directory `.'
[00:01:32] + CFLAGS='-O2 -g -pipe -Wall -Wp,-D_FORTIFY_SOURCE=2 -fexceptions -fstack-protector-strong --param=ssp-buffer-size=4 -grecord-gcc-switches   -m64 -mtune=generic'
[00:01:32] + export CFLAGS
[00:01:32] + CXXFLAGS='-O2 -g -pipe -Wall -Wp,-D_FORTIFY_SOURCE=2 -fexceptions -fstack-protector-strong --param=ssp-buffer-size=4 -grecord-gcc-switches   -m64 -mtune=generic'
[00:01:32] + export CXXFLAGS
[00:01:32] + FFLAGS='-O2 -g -pipe -Wall -Wp,-D_FORTIFY_SOURCE=2 -fexceptions -fstack-protector-strong --param=ssp-buffer-size=4 -grecord-gcc-switches   -m64 -mtune=generic -I/usr/lib64/gfortran/modules'
[00:01:32] + export FFLAGS
[00:01:32] + FCFLAGS='-O2 -g -pipe -Wall -Wp,-D_FORTIFY_SOURCE=2 -fexceptions -fstack-protector-strong --param=ssp-buffer-size=4 -grecord-gcc-switches   -m64 -mtune=generic -I/usr/lib64/gfortran/modules'
[00:01:32] + export FCFLAGS
[00:01:32] + LDFLAGS='-Wl,-z,relro '
[00:01:32] + export LDFLAGS
[00:01:32] + '[' 1 == 1 ']'
[00:01:32] + '[' x86_64 == ppc64le ']'
[00:01:32] ++ find . -name config.guess -o -name config.sub
[00:01:32] + ./configure --build=x86_64-redhat-linux-gnu --host=x86_64-redhat-linux-gnu --program-prefix= --disable-dependency-tracking --prefix=/usr --exec-prefix=/usr --bindir=/usr/bin --sbindir=/usr/sbin --sysconfdir=/etc --datadir=/usr/share --includedir=/usr/include --libdir=/usr/lib64 --libexecdir=/usr/libexec --localstatedir=/var --sharedstatedir=/var/lib --mandir=/usr/share/man --infodir=/usr/share/info
[00:01:32] checking for a BSD-compatible install... /usr/bin/install -c
[00:01:32] checking whether build environment is sane... yes
[00:01:32] /root/rpmbuild/BUILD/pykolab-0.8.9/missing: Unknown `--is-lightweight' option
[00:01:32] Try `/root/rpmbuild/BUILD/pykolab-0.8.9/missing --help' for more information
[00:01:32] configure: WARNING: 'missing' script is too old or missing
[00:01:32] checking for a thread-safe mkdir -p... /usr/bin/mkdir -p
[00:01:32] checking for gawk... gawk
[00:01:32] checking whether make sets $(MAKE)... yes
[00:01:32] checking whether make supports nested variables... yes
[00:01:32] checking whether to enable maintainer-specific portions of Makefiles... no
[00:01:32] checking for python... /usr/bin/python
[00:01:32] checking for python version... 2.7
[00:01:32] checking for python platform... linux2
[00:01:32] checking for python script directory... ${prefix}/lib/python2.7/site-packages
[00:01:32] checking for python extension module directory... ${exec_prefix}/lib64/python2.7/site-packages
[00:01:32] checking for style of include used by make... GNU
[00:01:32] checking for x86_64-redhat-linux-gnu-gcc... no
[00:01:32] checking for gcc... gcc
[00:01:32] checking whether the C compiler works... yes
[00:01:32] checking for C compiler default output file name... a.out
[00:01:32] checking for suffix of executables... 
[00:01:32] checking whether we are cross compiling... no
[00:01:32] checking for suffix of object files... o
[00:01:32] checking whether we are using the GNU C compiler... yes
[00:01:32] checking whether gcc accepts -g... yes
[00:01:32] checking for gcc option to accept ISO C89... none needed
[00:01:32] checking dependency style of gcc... none
[00:01:32] checking how to run the C preprocessor... gcc -E
[00:01:32] checking for grep that handles long lines and -e... /usr/bin/grep
[00:01:32] checking for egrep... /usr/bin/grep -E
[00:01:32] checking for ANSI C header files... yes
[00:01:32] checking for sys/types.h... yes
[00:01:32] checking for sys/stat.h... yes
[00:01:32] checking for stdlib.h... yes
[00:01:32] checking for string.h... yes
[00:01:32] checking for memory.h... yes
[00:01:32] checking for strings.h... yes
[00:01:33] checking for inttypes.h... yes
[00:01:33] checking for stdint.h... yes
[00:01:33] checking for unistd.h... yes
[00:01:33] checking locale.h usability... yes
[00:01:33] checking locale.h presence... yes
[00:01:33] checking for locale.h... yes
[00:01:33] checking for LC_MESSAGES... yes
[00:01:33] checking for CFPreferencesCopyAppValue... no
[00:01:33] checking for CFLocaleCopyCurrent... no
[00:01:33] checking libintl.h usability... yes
[00:01:33] checking libintl.h presence... yes
[00:01:33] checking for libintl.h... yes
[00:01:33] checking for ngettext in libc... yes
[00:01:33] checking for dgettext in libc... yes
[00:01:33] checking for bind_textdomain_codeset... yes
[00:01:33] checking for msgfmt... /usr/bin/msgfmt
[00:01:33] checking for dcgettext... yes
[00:01:33] checking if msgfmt accepts -c... yes
[00:01:33] checking for gmsgfmt... /usr/bin/msgfmt
[00:01:33] checking for xgettext... /usr/bin/xgettext
[00:01:33] checking for catalogs to be installed...  ach af af_ZA ak de de_DE es fr nl
[00:01:33] checking whether NLS is requested... yes
[00:01:33] checking for intltool-update... /usr/bin/intltool-update
[00:01:33] checking for intltool-merge... /usr/bin/intltool-merge
[00:01:33] checking for intltool-extract... /usr/bin/intltool-extract
[00:01:33] checking for xgettext... (cached) /usr/bin/xgettext
[00:01:33] checking for msgmerge... /usr/bin/msgmerge
[00:01:33] checking for msgfmt... (cached) /usr/bin/msgfmt
[00:01:33] checking for gmsgfmt... (cached) /usr/bin/msgfmt
[00:01:33] checking for perl... /usr/bin/perl
[00:01:33] checking for perl >= 5.8.1... 5.16.3
[00:01:33] checking for XML::Parser... ok
[00:01:33] checking whether ln -s works... yes
[00:01:33] checking that generated files are newer than configure... done
[00:01:33] configure: creating ./config.status
[00:01:33] config.status: creating bin/rebuild.sh
[00:01:33] config.status: creating Makefile
[00:01:33] config.status: creating pykolab.spec
[00:01:33] config.status: creating conf/Makefile
[00:01:33] config.status: creating kolabd/Makefile
[00:01:33] config.status: creating po/Makefile.in
[00:01:33] config.status: creating pykolab/constants.py
[00:01:33] config.status: creating pykolab/Makefile
[00:01:34] config.status: creating saslauthd/Makefile
[00:01:34] config.status: creating share/Makefile
[00:01:34] config.status: creating wallace/Makefile
[00:01:34] config.status: executing depfiles commands
[00:01:34] config.status: executing default-1 commands
[00:01:34] config.status: executing po/stamp-it commands
[00:01:34] + exit 0
[00:01:34] Executing(%install): /bin/sh -e /var/tmp/rpm-tmp.zPzpBb
[00:01:34] + umask 022
[00:01:34] + cd /root/rpmbuild/BUILD
[00:01:34] + '[' /root/rpmbuild/BUILDROOT/pykolab-0.8.9-107.tbits20190107.el7.x86_64 '!=' / ']'
[00:01:34] + rm -rf /root/rpmbuild/BUILDROOT/pykolab-0.8.9-107.tbits20190107.el7.x86_64
[00:01:34] ++ dirname /root/rpmbuild/BUILDROOT/pykolab-0.8.9-107.tbits20190107.el7.x86_64
[00:01:34] + mkdir -p /root/rpmbuild/BUILDROOT
[00:01:34] + mkdir /root/rpmbuild/BUILDROOT/pykolab-0.8.9-107.tbits20190107.el7.x86_64
[00:01:34] + cd pykolab-0.8.9
[00:01:34] + rm -rf /root/rpmbuild/BUILDROOT/pykolab-0.8.9-107.tbits20190107.el7.x86_64
[00:01:34] + make install DESTDIR=/root/rpmbuild/BUILDROOT/pykolab-0.8.9-107.tbits20190107.el7.x86_64
[00:01:34] Making install in conf
[00:01:34] make[1]: Entering directory `/root/rpmbuild/BUILD/pykolab-0.8.9/conf'
[00:01:34] make[2]: Entering directory `/root/rpmbuild/BUILD/pykolab-0.8.9/conf'
[00:01:34] make[2]: Nothing to be done for `install-exec-am'.
[00:01:34]  /usr/bin/mkdir -p '/root/rpmbuild/BUILDROOT/pykolab-0.8.9-107.tbits20190107.el7.x86_64/etc/kolab'
[00:01:34]  /usr/bin/install -c -m 644 kolab.conf '/root/rpmbuild/BUILDROOT/pykolab-0.8.9-107.tbits20190107.el7.x86_64/etc/kolab'
[00:01:34] make[2]: Leaving directory `/root/rpmbuild/BUILD/pykolab-0.8.9/conf'
[00:01:34] make[1]: Leaving directory `/root/rpmbuild/BUILD/pykolab-0.8.9/conf'
[00:01:34] Making install in kolabd
[00:01:34] make[1]: Entering directory `/root/rpmbuild/BUILD/pykolab-0.8.9/kolabd'
[00:01:34] make[2]: Entering directory `/root/rpmbuild/BUILD/pykolab-0.8.9/kolabd'
[00:01:34] mkdir -p /root/rpmbuild/BUILDROOT/pykolab-0.8.9-107.tbits20190107.el7.x86_64//usr/sbin \
[00:01:34] 	/root/rpmbuild/BUILDROOT/pykolab-0.8.9-107.tbits20190107.el7.x86_64//var/run/kolabd
[00:01:34]  /usr/bin/mkdir -p '/root/rpmbuild/BUILDROOT/pykolab-0.8.9-107.tbits20190107.el7.x86_64/usr/lib/python2.7/site-packages/kolabd'
[00:01:34]  /usr/bin/install -c -m 644 process.py __init__.py '/root/rpmbuild/BUILDROOT/pykolab-0.8.9-107.tbits20190107.el7.x86_64/usr/lib/python2.7/site-packages/kolabd'
[00:01:34] Byte-compiling python modules...
[00:01:34] process.py__init__.py
[00:01:34] Byte-compiling python modules (optimized versions) ...
[00:01:34] process.py__init__.py
[00:01:34] make[2]: Leaving directory `/root/rpmbuild/BUILD/pykolab-0.8.9/kolabd'
[00:01:34] make[1]: Leaving directory `/root/rpmbuild/BUILD/pykolab-0.8.9/kolabd'
[00:01:34] Making install in po
[00:01:34] make[1]: Entering directory `/root/rpmbuild/BUILD/pykolab-0.8.9/po'
[00:01:34] file=`echo ach | sed 's,.*/,,'`.gmo \
[00:01:34]   && rm -f $file && /usr/bin/msgfmt -o $file ach.po
[00:01:34] file=`echo af | sed 's,.*/,,'`.gmo \
[00:01:34]   && rm -f $file && /usr/bin/msgfmt -o $file af.po
[00:01:34] file=`echo af_ZA | sed 's,.*/,,'`.gmo \
[00:01:34]   && rm -f $file && /usr/bin/msgfmt -o $file af_ZA.po
[00:01:34] file=`echo ak | sed 's,.*/,,'`.gmo \
[00:01:34]   && rm -f $file && /usr/bin/msgfmt -o $file ak.po
[00:01:34] file=`echo de | sed 's,.*/,,'`.gmo \
[00:01:34]   && rm -f $file && /usr/bin/msgfmt -o $file de.po
[00:01:34] file=`echo de_DE | sed 's,.*/,,'`.gmo \
[00:01:34]   && rm -f $file && /usr/bin/msgfmt -o $file de_DE.po
[00:01:34] file=`echo es | sed 's,.*/,,'`.gmo \
[00:01:34]   && rm -f $file && /usr/bin/msgfmt -o $file es.po
[00:01:34] file=`echo fr | sed 's,.*/,,'`.gmo \
[00:01:34]   && rm -f $file && /usr/bin/msgfmt -o $file fr.po
[00:01:34] file=`echo nl | sed 's,.*/,,'`.gmo \
[00:01:34]   && rm -f $file && /usr/bin/msgfmt -o $file nl.po
[00:01:34] linguas="ach af af_ZA ak de de_DE es fr nl "; \
[00:01:34] for lang in $linguas; do \
[00:01:34]   dir=/root/rpmbuild/BUILDROOT/pykolab-0.8.9-107.tbits20190107.el7.x86_64/usr/share/locale/$lang/LC_MESSAGES; \
[00:01:34]   /bin/sh /root/rpmbuild/BUILD/pykolab-0.8.9/install-sh -d $dir; \
[00:01:34]   if test -r $lang.gmo; then \
[00:01:34]     /usr/bin/install -c -m 644 $lang.gmo $dir/pykolab.mo; \
[00:01:34]     echo "installing $lang.gmo as $dir/pykolab.mo"; \
[00:01:34]   else \
[00:01:34]     /usr/bin/install -c -m 644 ./$lang.gmo $dir/pykolab.mo; \
[00:01:34]     echo "installing ./$lang.gmo as" \
[00:01:34] 	 "$dir/pykolab.mo"; \
[00:01:34]   fi; \
[00:01:34]   if test -r $lang.gmo.m; then \
[00:01:34]     /usr/bin/install -c -m 644 $lang.gmo.m $dir/pykolab.mo.m; \
[00:01:34]     echo "installing $lang.gmo.m as $dir/pykolab.mo.m"; \
[00:01:34]   else \
[00:01:34]     if test -r ./$lang.gmo.m ; then \
[00:01:34]       /usr/bin/install -c -m 644 ./$lang.gmo.m \
[00:01:34] 	$dir/pykolab.mo.m; \
[00:01:34]       echo "installing ./$lang.gmo.m as" \
[00:01:34] 	   "$dir/pykolab.mo.m"; \
[00:01:34]     else \
[00:01:34]       true; \
[00:01:34]     fi; \
[00:01:34]   fi; \
[00:01:34] done
[00:01:34] installing ach.gmo as /root/rpmbuild/BUILDROOT/pykolab-0.8.9-107.tbits20190107.el7.x86_64/usr/share/locale/ach/LC_MESSAGES/pykolab.mo
[00:01:34] installing af.gmo as /root/rpmbuild/BUILDROOT/pykolab-0.8.9-107.tbits20190107.el7.x86_64/usr/share/locale/af/LC_MESSAGES/pykolab.mo
[00:01:34] installing af_ZA.gmo as /root/rpmbuild/BUILDROOT/pykolab-0.8.9-107.tbits20190107.el7.x86_64/usr/share/locale/af_ZA/LC_MESSAGES/pykolab.mo
[00:01:34] installing ak.gmo as /root/rpmbuild/BUILDROOT/pykolab-0.8.9-107.tbits20190107.el7.x86_64/usr/share/locale/ak/LC_MESSAGES/pykolab.mo
[00:01:34] installing de.gmo as /root/rpmbuild/BUILDROOT/pykolab-0.8.9-107.tbits20190107.el7.x86_64/usr/share/locale/de/LC_MESSAGES/pykolab.mo
[00:01:34] installing de_DE.gmo as /root/rpmbuild/BUILDROOT/pykolab-0.8.9-107.tbits20190107.el7.x86_64/usr/share/locale/de_DE/LC_MESSAGES/pykolab.mo
[00:01:34] installing es.gmo as /root/rpmbuild/BUILDROOT/pykolab-0.8.9-107.tbits20190107.el7.x86_64/usr/share/locale/es/LC_MESSAGES/pykolab.mo
[00:01:34] installing fr.gmo as /root/rpmbuild/BUILDROOT/pykolab-0.8.9-107.tbits20190107.el7.x86_64/usr/share/locale/fr/LC_MESSAGES/pykolab.mo
[00:01:34] installing nl.gmo as /root/rpmbuild/BUILDROOT/pykolab-0.8.9-107.tbits20190107.el7.x86_64/usr/share/locale/nl/LC_MESSAGES/pykolab.mo
[00:01:34] make[1]: Leaving directory `/root/rpmbuild/BUILD/pykolab-0.8.9/po'
[00:01:34] Making install in pykolab
[00:01:34] make[1]: Entering directory `/root/rpmbuild/BUILD/pykolab-0.8.9/pykolab'
[00:01:34] make[2]: Entering directory `/root/rpmbuild/BUILD/pykolab-0.8.9/pykolab'
[00:01:34] make[2]: Nothing to be done for `install-exec-am'.
[00:01:34]  /usr/bin/mkdir -p '/root/rpmbuild/BUILDROOT/pykolab-0.8.9-107.tbits20190107.el7.x86_64/usr/lib/python2.7/site-packages/pykolab'
[00:01:34]  /usr/bin/install -c -m 644 telemetry.py translit.py utils.py base.py errors.py __init__.py translate.py constants.py logger.py imap_utf7.py '/root/rpmbuild/BUILDROOT/pykolab-0.8.9-107.tbits20190107.el7.x86_64/usr/lib/python2.7/site-packages/pykolab'
[00:01:34] Byte-compiling python modules...
[00:01:34] telemetry.pytranslit.pyutils.pybase.pyerrors.py__init__.pytranslate.pyconstants.pylogger.pyimap_utf7.py
[00:01:34] Byte-compiling python modules (optimized versions) ...
[00:01:34] telemetry.pytranslit.pyutils.pybase.pyerrors.py__init__.pytranslate.pyconstants.pylogger.pyimap_utf7.py
[00:01:34]  /usr/bin/mkdir -p '/root/rpmbuild/BUILDROOT/pykolab-0.8.9-107.tbits20190107.el7.x86_64/usr/lib/python2.7/site-packages/pykolab/auth'
[00:01:34]  /usr/bin/install -c -m 644 auth/__init__.py '/root/rpmbuild/BUILDROOT/pykolab-0.8.9-107.tbits20190107.el7.x86_64/usr/lib/python2.7/site-packages/pykolab/auth'
[00:01:34] Byte-compiling python modules...
[00:01:34] __init__.py
[00:01:34] Byte-compiling python modules (optimized versions) ...
[00:01:34] __init__.py
[00:01:34]  /usr/bin/mkdir -p '/root/rpmbuild/BUILDROOT/pykolab-0.8.9-107.tbits20190107.el7.x86_64/usr/lib/python2.7/site-packages/pykolab/auth/ldap'
[00:01:34]  /usr/bin/install -c -m 644 auth/ldap/__init__.py auth/ldap/auth_cache.py auth/ldap/cache.py auth/ldap/syncrepl.py '/root/rpmbuild/BUILDROOT/pykolab-0.8.9-107.tbits20190107.el7.x86_64/usr/lib/python2.7/site-packages/pykolab/auth/ldap'
[00:01:34] Byte-compiling python modules...
[00:01:34] __init__.pyauth_cache.pycache.pysyncrepl.py
[00:01:34] Byte-compiling python modules (optimized versions) ...
[00:01:34] __init__.pyauth_cache.pycache.pysyncrepl.py
[00:01:34]  /usr/bin/mkdir -p '/root/rpmbuild/BUILDROOT/pykolab-0.8.9-107.tbits20190107.el7.x86_64/usr/lib/python2.7/site-packages/pykolab/cli'
[00:01:34]  /usr/bin/install -c -m 644 cli/cmd_list_domains.py cli/cmd_list_users.py cli/cmd_set_mail.py cli/cmd_mailbox_cleanup.py cli/cmd_list_ous.py cli/cmd_delete_domain.py cli/cmd_user_info.py cli/cmd_set_language.py cli/cmd_set_mailbox_acl.py cli/cmd_server_info.py cli/cmd_list_domain_mailboxes.py cli/cmd_find_domain.py cli/cmd_sync.py cli/cmd_delete_message.py cli/cmd_set_quota.py cli/cmd_set_mailbox_metadata.py cli/cmd_sync_mailhost_attrs.py cli/cmd_check_quota.py cli/cmd_add_user_subscription.py cli/cmd_remove_mailaddress.py cli/cmd_remove_user_subscription.py cli/cmd_delete_mailbox.py cli/cmd_add_domain.py cli/cmd_list_messages.py cli/__init__.py cli/cmd_export_mailbox.py cli/cmd_acl_cleanup.py cli/cmd_list_deleted_mailboxes.py cli/cmd_rename_mailbox.py cli/cmd_list_mailboxes.py cli/cmd_count_domain_mailboxes.py cli/cmd_transfer_mailbox.py cli/cmd_list_quota.py cli/cmd_list_user_subscriptions.py cli/cmd_list_mailbox_metadata.py cli/cmd_create_mailbox.py cli/cmd_list_mailbox_acls.py cli/cmd_add_alias.py cli/cmd_undelete_mailbox.py cli/cmd_delete_mailbox_acl.py '/root/rpmbuild/BUILDROOT/pykolab-0.8.9-107.tbits20190107.el7.x86_64/usr/lib/python2.7/site-packages/pykolab/cli'
[00:01:34]  /usr/bin/install -c -m 644 cli/cmd_add_user.py cli/commands.py '/root/rpmbuild/BUILDROOT/pykolab-0.8.9-107.tbits20190107.el7.x86_64/usr/lib/python2.7/site-packages/pykolab/cli'
[00:01:34] Byte-compiling python modules...
[00:01:34] cmd_list_domains.pycmd_list_users.pycmd_set_mail.pycmd_mailbox_cleanup.pycmd_list_ous.pycmd_delete_domain.pycmd_user_info.pycmd_set_language.pycmd_set_mailbox_acl.pycmd_server_info.pycmd_list_domain_mailboxes.pycmd_find_domain.pycmd_sync.pycmd_delete_message.pycmd_set_quota.pycmd_set_mailbox_metadata.pycmd_sync_mailhost_attrs.pycmd_check_quota.pycmd_add_user_subscription.pycmd_remove_mailaddress.pycmd_remove_user_subscription.pycmd_delete_mailbox.pycmd_add_domain.pycmd_list_messages.py__init__.pycmd_export_mailbox.pycmd_acl_cleanup.pycmd_list_deleted_mailboxes.pycmd_rename_mailbox.pycmd_list_mailboxes.pycmd_count_domain_mailboxes.pycmd_transfer_mailbox.pycmd_list_quota.pycmd_list_user_subscriptions.pycmd_list_mailbox_metadata.pycmd_create_mailbox.pycmd_list_mailbox_acls.pycmd_add_alias.pycmd_undelete_mailbox.pycmd_delete_mailbox_acl.pycmd_add_user.pycommands.py
[00:01:34] Byte-compiling python modules (optimized versions) ...
[00:01:34] cmd_list_domains.pycmd_list_users.pycmd_set_mail.pycmd_mailbox_cleanup.pycmd_list_ous.pycmd_delete_domain.pycmd_user_info.pycmd_set_language.pycmd_set_mailbox_acl.pycmd_server_info.pycmd_list_domain_mailboxes.pycmd_find_domain.pycmd_sync.pycmd_delete_message.pycmd_set_quota.pycmd_set_mailbox_metadata.pycmd_sync_mailhost_attrs.pycmd_check_quota.pycmd_add_user_subscription.pycmd_remove_mailaddress.pycmd_remove_user_subscription.pycmd_delete_mailbox.pycmd_add_domain.pycmd_list_messages.py__init__.pycmd_export_mailbox.pycmd_acl_cleanup.pycmd_list_deleted_mailboxes.pycmd_rename_mailbox.pycmd_list_mailboxes.pycmd_count_domain_mailboxes.pycmd_transfer_mailbox.pycmd_list_quota.pycmd_list_user_subscriptions.pycmd_list_mailbox_metadata.pycmd_create_mailbox.pycmd_list_mailbox_acls.pycmd_add_alias.pycmd_undelete_mailbox.pycmd_delete_mailbox_acl.pycmd_add_user.pycommands.py
[00:01:34]  /usr/bin/mkdir -p '/root/rpmbuild/BUILDROOT/pykolab-0.8.9-107.tbits20190107.el7.x86_64/usr/lib/python2.7/site-packages/pykolab/cli/sieve'
[00:01:34]  /usr/bin/install -c -m 644 cli/sieve/cmd_refresh.py cli/sieve/cmd_list.py cli/sieve/cmd_test.py cli/sieve/__init__.py cli/sieve/cmd_put.py '/root/rpmbuild/BUILDROOT/pykolab-0.8.9-107.tbits20190107.el7.x86_64/usr/lib/python2.7/site-packages/pykolab/cli/sieve'
[00:01:35] Byte-compiling python modules...
[00:01:35] cmd_refresh.pycmd_list.pycmd_test.py__init__.pycmd_put.py
[00:01:35] Byte-compiling python modules (optimized versions) ...
[00:01:35] cmd_refresh.pycmd_list.pycmd_test.py__init__.pycmd_put.py
[00:01:35]  /usr/bin/mkdir -p '/root/rpmbuild/BUILDROOT/pykolab-0.8.9-107.tbits20190107.el7.x86_64/usr/lib/python2.7/site-packages/pykolab/cli/telemetry'
[00:01:35]  /usr/bin/install -c -m 644 cli/telemetry/cmd_list_sessions.py cli/telemetry/cmd_expire_sessions.py cli/telemetry/__init__.py cli/telemetry/cmd_examine_session.py cli/telemetry/cmd_examine_command_issue.py '/root/rpmbuild/BUILDROOT/pykolab-0.8.9-107.tbits20190107.el7.x86_64/usr/lib/python2.7/site-packages/pykolab/cli/telemetry'
[00:01:35] Byte-compiling python modules...
[00:01:35] cmd_list_sessions.pycmd_expire_sessions.py__init__.pycmd_examine_session.pycmd_examine_command_issue.py
[00:01:35] Byte-compiling python modules (optimized versions) ...
[00:01:35] cmd_list_sessions.pycmd_expire_sessions.py__init__.pycmd_examine_session.pycmd_examine_command_issue.py
[00:01:35]  /usr/bin/mkdir -p '/root/rpmbuild/BUILDROOT/pykolab-0.8.9-107.tbits20190107.el7.x86_64/usr/lib/python2.7/site-packages/pykolab/cli/wap'
[00:01:35]  /usr/bin/install -c -m 644 cli/wap/cmd_user_types_list.py cli/wap/cmd_system_capabilities.py cli/wap/__init__.py '/root/rpmbuild/BUILDROOT/pykolab-0.8.9-107.tbits20190107.el7.x86_64/usr/lib/python2.7/site-packages/pykolab/cli/wap'
[00:01:35] Byte-compiling python modules...
[00:01:35] cmd_user_types_list.pycmd_system_capabilities.py__init__.py
[00:01:35] Byte-compiling python modules (optimized versions) ...
[00:01:35] cmd_user_types_list.pycmd_system_capabilities.py__init__.py
[00:01:35]  /usr/bin/mkdir -p '/root/rpmbuild/BUILDROOT/pykolab-0.8.9-107.tbits20190107.el7.x86_64/usr/lib/python2.7/site-packages/pykolab/conf'
[00:01:35]  /usr/bin/install -c -m 644 conf/defaults.py conf/__init__.py '/root/rpmbuild/BUILDROOT/pykolab-0.8.9-107.tbits20190107.el7.x86_64/usr/lib/python2.7/site-packages/pykolab/conf'
[00:01:35] Byte-compiling python modules...
[00:01:35] defaults.py__init__.py
[00:01:35] Byte-compiling python modules (optimized versions) ...
[00:01:35] defaults.py__init__.py
[00:01:35]  /usr/bin/mkdir -p '/root/rpmbuild/BUILDROOT/pykolab-0.8.9-107.tbits20190107.el7.x86_64/usr/lib/python2.7/site-packages/pykolab/imap'
[00:01:35]  /usr/bin/install -c -m 644 imap/__init__.py imap/cyrus.py imap/dovecot.py '/root/rpmbuild/BUILDROOT/pykolab-0.8.9-107.tbits20190107.el7.x86_64/usr/lib/python2.7/site-packages/pykolab/imap'
[00:01:35] Byte-compiling python modules...
[00:01:35] __init__.pycyrus.pydovecot.py
[00:01:35] Byte-compiling python modules (optimized versions) ...
[00:01:35] __init__.pycyrus.pydovecot.py
[00:01:35]  /usr/bin/mkdir -p '/root/rpmbuild/BUILDROOT/pykolab-0.8.9-107.tbits20190107.el7.x86_64/usr/lib/python2.7/site-packages/pykolab/itip'
[00:01:35]  /usr/bin/install -c -m 644 itip/__init__.py '/root/rpmbuild/BUILDROOT/pykolab-0.8.9-107.tbits20190107.el7.x86_64/usr/lib/python2.7/site-packages/pykolab/itip'
[00:01:35] Byte-compiling python modules...
[00:01:35] __init__.py
[00:01:35] Byte-compiling python modules (optimized versions) ...
[00:01:35] __init__.py
[00:01:35]  /usr/bin/mkdir -p '/root/rpmbuild/BUILDROOT/pykolab-0.8.9-107.tbits20190107.el7.x86_64/usr/lib/python2.7/site-packages/pykolab/plugins'
[00:01:35]  /usr/bin/install -c -m 644 plugins/__init__.py '/root/rpmbuild/BUILDROOT/pykolab-0.8.9-107.tbits20190107.el7.x86_64/usr/lib/python2.7/site-packages/pykolab/plugins'
[00:01:35] Byte-compiling python modules...
[00:01:35] __init__.py
[00:01:35] Byte-compiling python modules (optimized versions) ...
[00:01:35] __init__.py
[00:01:35]  /usr/bin/mkdir -p '/root/rpmbuild/BUILDROOT/pykolab-0.8.9-107.tbits20190107.el7.x86_64/usr/lib/python2.7/site-packages/pykolab/plugins/defaultfolders'
[00:01:35]  /usr/bin/install -c -m 644 plugins/defaultfolders/__init__.py '/root/rpmbuild/BUILDROOT/pykolab-0.8.9-107.tbits20190107.el7.x86_64/usr/lib/python2.7/site-packages/pykolab/plugins/defaultfolders'
[00:01:35] Byte-compiling python modules...
[00:01:35] __init__.py
[00:01:35] Byte-compiling python modules (optimized versions) ...
[00:01:35] __init__.py
[00:01:35]  /usr/bin/mkdir -p '/root/rpmbuild/BUILDROOT/pykolab-0.8.9-107.tbits20190107.el7.x86_64/usr/lib/python2.7/site-packages/pykolab/plugins/dynamicquota'
[00:01:35]  /usr/bin/install -c -m 644 plugins/dynamicquota/__init__.py '/root/rpmbuild/BUILDROOT/pykolab-0.8.9-107.tbits20190107.el7.x86_64/usr/lib/python2.7/site-packages/pykolab/plugins/dynamicquota'
[00:01:35] Byte-compiling python modules...
[00:01:35] __init__.py
[00:01:35] Byte-compiling python modules (optimized versions) ...
[00:01:35] __init__.py
[00:01:35]  /usr/bin/mkdir -p '/root/rpmbuild/BUILDROOT/pykolab-0.8.9-107.tbits20190107.el7.x86_64/usr/lib/python2.7/site-packages/pykolab/plugins/recipientpolicy'
[00:01:35]  /usr/bin/install -c -m 644 plugins/recipientpolicy/__init__.py '/root/rpmbuild/BUILDROOT/pykolab-0.8.9-107.tbits20190107.el7.x86_64/usr/lib/python2.7/site-packages/pykolab/plugins/recipientpolicy'
[00:01:35] Byte-compiling python modules...
[00:01:35] __init__.py
[00:01:35] Byte-compiling python modules (optimized versions) ...
[00:01:35] __init__.py
[00:01:35]  /usr/bin/mkdir -p '/root/rpmbuild/BUILDROOT/pykolab-0.8.9-107.tbits20190107.el7.x86_64/usr/lib/python2.7/site-packages/pykolab/plugins/sievemgmt'
[00:01:35]  /usr/bin/install -c -m 644 plugins/sievemgmt/__init__.py '/root/rpmbuild/BUILDROOT/pykolab-0.8.9-107.tbits20190107.el7.x86_64/usr/lib/python2.7/site-packages/pykolab/plugins/sievemgmt'
[00:01:35] Byte-compiling python modules...
[00:01:35] __init__.py
[00:01:35] Byte-compiling python modules (optimized versions) ...
[00:01:35] __init__.py
[00:01:35]  /usr/bin/mkdir -p '/root/rpmbuild/BUILDROOT/pykolab-0.8.9-107.tbits20190107.el7.x86_64/usr/lib/python2.7/site-packages/pykolab/setup'
[00:01:35]  /usr/bin/install -c -m 644 setup/components.py setup/setup_freebusy.py setup/setup_guam.py setup/setup_imap.py setup/setup_kolabd.py setup/setup_ldap.py setup/setup_manticore.py setup/setup_mta.py setup/setup_mysql.py setup/setup_php.py setup/setup_roundcube.py setup/setup_syncroton.py setup/__init__.py '/root/rpmbuild/BUILDROOT/pykolab-0.8.9-107.tbits20190107.el7.x86_64/usr/lib/python2.7/site-packages/pykolab/setup'
[00:01:35] Byte-compiling python modules...
[00:01:35] components.pysetup_freebusy.pysetup_guam.pysetup_imap.pysetup_kolabd.pysetup_ldap.pysetup_manticore.pysetup_mta.pysetup_mysql.pysetup_php.pysetup_roundcube.pysetup_syncroton.py__init__.py
[00:01:35] Byte-compiling python modules (optimized versions) ...
[00:01:35] components.pysetup_freebusy.pysetup_guam.pysetup_imap.pysetup_kolabd.pysetup_ldap.pysetup_manticore.pysetup_mta.pysetup_mysql.pysetup_php.pysetup_roundcube.pysetup_syncroton.py__init__.py
[00:01:35]  /usr/bin/mkdir -p '/root/rpmbuild/BUILDROOT/pykolab-0.8.9-107.tbits20190107.el7.x86_64/usr/lib/python2.7/site-packages/pykolab/wap_client'
[00:01:35]  /usr/bin/install -c -m 644 wap_client/__init__.py '/root/rpmbuild/BUILDROOT/pykolab-0.8.9-107.tbits20190107.el7.x86_64/usr/lib/python2.7/site-packages/pykolab/wap_client'
[00:01:35] Byte-compiling python modules...
[00:01:35] __init__.py
[00:01:35] Byte-compiling python modules (optimized versions) ...
[00:01:35] __init__.py
[00:01:35]  /usr/bin/mkdir -p '/root/rpmbuild/BUILDROOT/pykolab-0.8.9-107.tbits20190107.el7.x86_64/usr/lib/python2.7/site-packages/pykolab/xml'
[00:01:35]  /usr/bin/install -c -m 644 xml/attendee.py xml/recurrence_rule.py xml/utils.py xml/event.py xml/todo.py xml/__init__.py xml/contact.py xml/note.py xml/contact_reference.py '/root/rpmbuild/BUILDROOT/pykolab-0.8.9-107.tbits20190107.el7.x86_64/usr/lib/python2.7/site-packages/pykolab/xml'
[00:01:35] Byte-compiling python modules...
[00:01:35] attendee.pyrecurrence_rule.pyutils.pyevent.pytodo.py__init__.pycontact.pynote.pycontact_reference.py
[00:01:35] Byte-compiling python modules (optimized versions) ...
[00:01:35] attendee.pyrecurrence_rule.pyutils.pyevent.pytodo.py__init__.pycontact.pynote.pycontact_reference.py
[00:01:35] make[2]: Leaving directory `/root/rpmbuild/BUILD/pykolab-0.8.9/pykolab'
[00:01:35] make[1]: Leaving directory `/root/rpmbuild/BUILD/pykolab-0.8.9/pykolab'
[00:01:35] Making install in saslauthd
[00:01:35] make[1]: Entering directory `/root/rpmbuild/BUILD/pykolab-0.8.9/saslauthd'
[00:01:35] make[2]: Entering directory `/root/rpmbuild/BUILD/pykolab-0.8.9/saslauthd'
[00:01:35] mkdir -p /root/rpmbuild/BUILDROOT/pykolab-0.8.9-107.tbits20190107.el7.x86_64//var/run/kolab-saslauthd \
[00:01:35] 	/root/rpmbuild/BUILDROOT/pykolab-0.8.9-107.tbits20190107.el7.x86_64//var/run/kolab-saslauthd \
[00:01:35] 	/root/rpmbuild/BUILDROOT/pykolab-0.8.9-107.tbits20190107.el7.x86_64//var/run/saslauthd \
[00:01:35] 	/root/rpmbuild/BUILDROOT/pykolab-0.8.9-107.tbits20190107.el7.x86_64//var/lib/kolab-saslauthd
[00:01:35]  /usr/bin/mkdir -p '/root/rpmbuild/BUILDROOT/pykolab-0.8.9-107.tbits20190107.el7.x86_64/usr/lib/python2.7/site-packages/saslauthd'
[00:01:35]  /usr/bin/install -c -m 644 __init__.py '/root/rpmbuild/BUILDROOT/pykolab-0.8.9-107.tbits20190107.el7.x86_64/usr/lib/python2.7/site-packages/saslauthd'
[00:01:35] Byte-compiling python modules...
[00:01:36] __init__.py
[00:01:36] Byte-compiling python modules (optimized versions) ...
[00:01:36] __init__.py
[00:01:36] make[2]: Leaving directory `/root/rpmbuild/BUILD/pykolab-0.8.9/saslauthd'
[00:01:36] make[1]: Leaving directory `/root/rpmbuild/BUILD/pykolab-0.8.9/saslauthd'
[00:01:36] Making install in share
[00:01:36] make[1]: Entering directory `/root/rpmbuild/BUILD/pykolab-0.8.9/share'
[00:01:36] make[2]: Entering directory `/root/rpmbuild/BUILD/pykolab-0.8.9/share'
[00:01:36] mkdir -p \
[00:01:36] 	/root/rpmbuild/BUILDROOT/pykolab-0.8.9-107.tbits20190107.el7.x86_64//etc/kolab/templates \
[00:01:36] 	/root/rpmbuild/BUILDROOT/pykolab-0.8.9-107.tbits20190107.el7.x86_64//etc/kolab/templates/roundcubemail
[00:01:36]  /usr/bin/mkdir -p '/root/rpmbuild/BUILDROOT/pykolab-0.8.9-107.tbits20190107.el7.x86_64/usr/share/kolab/templates/roundcubemail'
[00:01:36]  /usr/bin/install -c -m 644 templates/roundcubemail/recipient_to_contact.inc.php.tpl templates/roundcubemail/kolab_folders.inc.php.tpl templates/roundcubemail/kolab_delegation.inc.php.tpl templates/roundcubemail/mimetypes.php.tpl templates/roundcubemail/owncloud.inc.php.tpl templates/roundcubemail/kolab_auth.inc.php.tpl templates/roundcubemail/acl.inc.php.tpl templates/roundcubemail/libkolab.inc.php.tpl templates/roundcubemail/terms.inc.php.tpl templates/roundcubemail/terms.html.tpl templates/roundcubemail/calendar.inc.php.tpl templates/roundcubemail/config.inc.php.tpl templates/roundcubemail/managesieve.inc.php.tpl templates/roundcubemail/password.inc.php.tpl templates/roundcubemail/kolab_addressbook.inc.php.tpl templates/roundcubemail/kolab_files.inc.php.tpl '/root/rpmbuild/BUILDROOT/pykolab-0.8.9-107.tbits20190107.el7.x86_64/usr/share/kolab/templates/roundcubemail'
[00:01:36]  /usr/bin/mkdir -p '/root/rpmbuild/BUILDROOT/pykolab-0.8.9-107.tbits20190107.el7.x86_64/usr/share/kolab/templates'
[00:01:36]  /usr/bin/install -c -m 644 templates/cyrus.conf.tpl templates/imapd.conf.tpl templates/amavisd.conf.tpl templates/freshclam.conf.tpl templates/guam.sys.config.tpl templates/master.cf.tpl templates/manticore.js.tpl templates/header_checks.submission templates/header_checks.inbound templates/header_checks.internal '/root/rpmbuild/BUILDROOT/pykolab-0.8.9-107.tbits20190107.el7.x86_64/usr/share/kolab/templates'
[00:01:36] make[2]: Leaving directory `/root/rpmbuild/BUILD/pykolab-0.8.9/share'
[00:01:36] make[1]: Leaving directory `/root/rpmbuild/BUILD/pykolab-0.8.9/share'
[00:01:36] Making install in wallace
[00:01:36] make[1]: Entering directory `/root/rpmbuild/BUILD/pykolab-0.8.9/wallace'
[00:01:36] make[2]: Entering directory `/root/rpmbuild/BUILD/pykolab-0.8.9/wallace'
[00:01:36] mkdir -p /root/rpmbuild/BUILDROOT/pykolab-0.8.9-107.tbits20190107.el7.x86_64//usr/sbin \
[00:01:36] 	/root/rpmbuild/BUILDROOT/pykolab-0.8.9-107.tbits20190107.el7.x86_64//var/run/wallaced
[00:01:36]  /usr/bin/mkdir -p '/root/rpmbuild/BUILDROOT/pykolab-0.8.9-107.tbits20190107.el7.x86_64/usr/lib/python2.7/site-packages/wallace'
[00:01:36]  /usr/bin/install -c -m 644 __init__.py modules.py module_footer.py module_invitationpolicy.py module_gpgencrypt.py module_resources.py module_optout.py '/root/rpmbuild/BUILDROOT/pykolab-0.8.9-107.tbits20190107.el7.x86_64/usr/lib/python2.7/site-packages/wallace'
[00:01:36] Byte-compiling python modules...
[00:01:36] __init__.pymodules.pymodule_footer.pymodule_invitationpolicy.pymodule_gpgencrypt.pymodule_resources.pymodule_optout.py
[00:01:36] Byte-compiling python modules (optimized versions) ...
[00:01:36] __init__.pymodules.pymodule_footer.pymodule_invitationpolicy.pymodule_gpgencrypt.pymodule_resources.pymodule_optout.py
[00:01:36] make[2]: Leaving directory `/root/rpmbuild/BUILD/pykolab-0.8.9/wallace'
[00:01:36] make[1]: Leaving directory `/root/rpmbuild/BUILD/pykolab-0.8.9/wallace'
[00:01:36] make[1]: Entering directory `/root/rpmbuild/BUILD/pykolab-0.8.9'
[00:01:36] make[2]: Entering directory `/root/rpmbuild/BUILD/pykolab-0.8.9'
[00:01:36] mkdir -p /root/rpmbuild/BUILDROOT/pykolab-0.8.9-107.tbits20190107.el7.x86_64//usr/sbin \
[00:01:36] 	/root/rpmbuild/BUILDROOT/pykolab-0.8.9-107.tbits20190107.el7.x86_64//usr/bin \
[00:01:36] 	/root/rpmbuild/BUILDROOT/pykolab-0.8.9-107.tbits20190107.el7.x86_64//etc/kolab \
[00:01:36] 	/root/rpmbuild/BUILDROOT/pykolab-0.8.9-107.tbits20190107.el7.x86_64//usr/libexec/postfix \
[00:01:36] 	/root/rpmbuild/BUILDROOT/pykolab-0.8.9-107.tbits20190107.el7.x86_64//var/lib/kolab \
[00:01:36] 	/root/rpmbuild/BUILDROOT/pykolab-0.8.9-107.tbits20190107.el7.x86_64//var/log/kolab \
[00:01:36] 	/root/rpmbuild/BUILDROOT/pykolab-0.8.9-107.tbits20190107.el7.x86_64//var/spool/pykolab/wallace
[00:01:36] /usr/bin/install -c -p -m 755 conf.py /root/rpmbuild/BUILDROOT/pykolab-0.8.9-107.tbits20190107.el7.x86_64//usr/sbin/kolab-conf
[00:01:36] /usr/bin/install -c -p -m 755 kolab-cli.py /root/rpmbuild/BUILDROOT/pykolab-0.8.9-107.tbits20190107.el7.x86_64//usr/sbin/kolab
[00:01:36] /usr/bin/install -c -p -m 755 kolabd.py /root/rpmbuild/BUILDROOT/pykolab-0.8.9-107.tbits20190107.el7.x86_64//usr/sbin/kolabd
[00:01:36] /usr/bin/install -c -p -m 755 saslauthd.py /root/rpmbuild/BUILDROOT/pykolab-0.8.9-107.tbits20190107.el7.x86_64//usr/sbin/kolab-saslauthd
[00:01:36] /usr/bin/install -c -p -m 755 wallace.py /root/rpmbuild/BUILDROOT/pykolab-0.8.9-107.tbits20190107.el7.x86_64//usr/sbin/wallaced
[00:01:36] /usr/bin/install -c -p -m 755 setup-kolab.py /root/rpmbuild/BUILDROOT/pykolab-0.8.9-107.tbits20190107.el7.x86_64//usr/sbin/setup-kolab
[00:01:36] /usr/bin/install -c -p -m 644 cyruslib.py /root/rpmbuild/BUILDROOT/pykolab-0.8.9-107.tbits20190107.el7.x86_64//usr/lib/python2.7/site-packages
[00:01:36] /usr/bin/install -c -p -m 755 bin/kolab_parse_telemetry.py /root/rpmbuild/BUILDROOT/pykolab-0.8.9-107.tbits20190107.el7.x86_64//usr/sbin/kolab_parse_telemetry
[00:01:36] /usr/bin/install -c -p -m 755 bin/kolab_smtp_access_policy.py /root/rpmbuild/BUILDROOT/pykolab-0.8.9-107.tbits20190107.el7.x86_64//usr/libexec/postfix/kolab_smtp_access_policy
[00:01:36] make[2]: Nothing to be done for `install-data-am'.
[00:01:36] make[2]: Leaving directory `/root/rpmbuild/BUILD/pykolab-0.8.9'
[00:01:36] make[1]: Leaving directory `/root/rpmbuild/BUILD/pykolab-0.8.9'
[00:01:36] + mkdir -p /root/rpmbuild/BUILDROOT/pykolab-0.8.9-107.tbits20190107.el7.x86_64/etc/logrotate.d
[00:01:36] + cp -pr /root/rpmbuild/SOURCES/pykolab.logrotate /root/rpmbuild/BUILDROOT/pykolab-0.8.9-107.tbits20190107.el7.x86_64/etc/logrotate.d/pykolab
[00:01:36] + mkdir -p /root/rpmbuild/BUILDROOT/pykolab-0.8.9-107.tbits20190107.el7.x86_64//usr/lib/systemd/system
[00:01:36] + /usr/bin/install -p -m 644 kolabd/kolabd.systemd /root/rpmbuild/BUILDROOT/pykolab-0.8.9-107.tbits20190107.el7.x86_64//usr/lib/systemd/system/kolabd.service
[00:01:36] + /usr/bin/install -p -m 644 saslauthd/kolab-saslauthd.systemd /root/rpmbuild/BUILDROOT/pykolab-0.8.9-107.tbits20190107.el7.x86_64//usr/lib/systemd/system/kolab-saslauthd.service
[00:01:36] + /usr/bin/install -p -m 644 wallace/wallace.systemd /root/rpmbuild/BUILDROOT/pykolab-0.8.9-107.tbits20190107.el7.x86_64//usr/lib/systemd/system/wallace.service
[00:01:36] + mkdir -p /root/rpmbuild/BUILDROOT/pykolab-0.8.9-107.tbits20190107.el7.x86_64//usr/lib/tmpfiles.d/
[00:01:36] + /usr/bin/install -p -m 644 kolabd/kolabd.tmpfiles.d.conf /root/rpmbuild/BUILDROOT/pykolab-0.8.9-107.tbits20190107.el7.x86_64//usr/lib/tmpfiles.d/kolabd.conf
[00:01:36] + /usr/bin/install -p -m 644 wallace/wallace.tmpfiles.d.conf /root/rpmbuild/BUILDROOT/pykolab-0.8.9-107.tbits20190107.el7.x86_64//usr/lib/tmpfiles.d/wallace.conf
[00:01:36] + mkdir -p /root/rpmbuild/BUILDROOT/pykolab-0.8.9-107.tbits20190107.el7.x86_64/run
[00:01:36] + /usr/bin/install -d -m 755 /root/rpmbuild/BUILDROOT/pykolab-0.8.9-107.tbits20190107.el7.x86_64/run/kolabd
[00:01:36] + /usr/bin/install -d -m 755 /root/rpmbuild/BUILDROOT/pykolab-0.8.9-107.tbits20190107.el7.x86_64/run/wallaced
[00:01:36] + mkdir -p /root/rpmbuild/BUILDROOT/pykolab-0.8.9-107.tbits20190107.el7.x86_64//etc/sysconfig
[00:01:36] + /usr/bin/install -p -m 644 kolabd/kolabd.sysconfig /root/rpmbuild/BUILDROOT/pykolab-0.8.9-107.tbits20190107.el7.x86_64//etc/sysconfig/kolabd
[00:01:36] + /usr/bin/install -p -m 644 saslauthd/kolab-saslauthd.sysconfig /root/rpmbuild/BUILDROOT/pykolab-0.8.9-107.tbits20190107.el7.x86_64//etc/sysconfig/kolab-saslauthd
[00:01:36] + /usr/bin/install -p -m 644 wallace/wallace.sysconfig /root/rpmbuild/BUILDROOT/pykolab-0.8.9-107.tbits20190107.el7.x86_64//etc/sysconfig/wallace
[00:01:36] + /usr/lib/rpm/find-lang.sh /root/rpmbuild/BUILDROOT/pykolab-0.8.9-107.tbits20190107.el7.x86_64 pykolab
[00:01:36] + /usr/lib/rpm/find-debuginfo.sh --strict-build-id -m --run-dwz --dwz-low-mem-die-limit 10000000 --dwz-max-die-limit 110000000 /root/rpmbuild/BUILD/pykolab-0.8.9
[00:01:36] /usr/lib/rpm/sepdebugcrcfix: Updated 0 CRC32s, 0 CRC32s did match.
[00:01:36] find: 'debug': No such file or directory
[00:01:36] + /usr/lib/rpm/check-buildroot
[00:01:36] + /usr/lib/rpm/redhat/brp-compress
[00:01:36] + /usr/lib/rpm/redhat/brp-strip-static-archive /usr/bin/strip
[00:01:36] + /usr/lib/rpm/brp-python-bytecompile /usr/bin/python 1
[00:01:36] Bytecompiling .py files below /root/rpmbuild/BUILDROOT/pykolab-0.8.9-107.tbits20190107.el7.x86_64/usr/lib/python2.7 using /usr/bin/python2.7
[00:01:36] + /usr/lib/rpm/redhat/brp-python-hardlink
[00:01:38] + /usr/lib/rpm/redhat/brp-java-repack-jars
[00:01:38] Executing(%check): /bin/sh -e /var/tmp/rpm-tmp.qz8xjE
[00:01:38] + umask 022
[00:01:38] + cd /root/rpmbuild/BUILD
[00:01:38] + cd pykolab-0.8.9
[00:01:38] + nosetests -v tests/unit/
[00:01:38] Usage: nosetests [options]
[00:01:38] 
[00:01:38] nosetests: error: no such option: -v
[00:01:38] + :
[00:01:38] + exit 0
[00:01:38] Processing files: pykolab-0.8.9-107.tbits20190107.el7.noarch
[00:01:38] Executing(%doc): /bin/sh -e /var/tmp/rpm-tmp.F2SxD8
[00:01:38] + umask 022
[00:01:38] + cd /root/rpmbuild/BUILD
[00:01:38] + cd pykolab-0.8.9
[00:01:38] + DOCDIR=/root/rpmbuild/BUILDROOT/pykolab-0.8.9-107.tbits20190107.el7.x86_64/usr/share/doc/pykolab-0.8.9
[00:01:38] + export DOCDIR
[00:01:38] + /usr/bin/mkdir -p /root/rpmbuild/BUILDROOT/pykolab-0.8.9-107.tbits20190107.el7.x86_64/usr/share/doc/pykolab-0.8.9
[00:01:38] + cp -pr AUTHORS /root/rpmbuild/BUILDROOT/pykolab-0.8.9-107.tbits20190107.el7.x86_64/usr/share/doc/pykolab-0.8.9
[00:01:38] + cp -pr COPYING /root/rpmbuild/BUILDROOT/pykolab-0.8.9-107.tbits20190107.el7.x86_64/usr/share/doc/pykolab-0.8.9
[00:01:38] + cp -pr README /root/rpmbuild/BUILDROOT/pykolab-0.8.9-107.tbits20190107.el7.x86_64/usr/share/doc/pykolab-0.8.9
[00:01:38] + cp -pr README.tests /root/rpmbuild/BUILDROOT/pykolab-0.8.9-107.tbits20190107.el7.x86_64/usr/share/doc/pykolab-0.8.9
[00:01:38] + cp -pr conf/kolab.conf /root/rpmbuild/BUILDROOT/pykolab-0.8.9-107.tbits20190107.el7.x86_64/usr/share/doc/pykolab-0.8.9
[00:01:38] + exit 0
[00:01:39] Provides: config(pykolab) = 0.8.9-107.tbits20190107.el7 pykolab = 0.8.9-107.tbits20190107.el7
[00:01:39] Requires(interp): /bin/sh
[00:01:39] Requires(rpmlib): rpmlib(CompressedFileNames) <= 3.0.4-1 rpmlib(FileDigests) <= 4.6.0-1 rpmlib(PartialHardlinkSets) <= 4.0.4-1 rpmlib(PayloadFilesHavePrefix) <= 4.0-1
[00:01:39] Requires(pre): /bin/sh /usr/sbin/groupadd /usr/sbin/useradd /usr/sbin/usermod
[00:01:39] Requires(post): systemd-units
[00:01:39] Requires(preun): coreutils systemd-units
[00:01:39] Requires(postun): systemd-units
[00:01:39] Requires: python(abi) = 2.7
[00:01:39] Processing files: pykolab-telemetry-0.8.9-107.tbits20190107.el7.noarch
[00:01:39] Executing(%doc): /bin/sh -e /var/tmp/rpm-tmp.GR3bXG
[00:01:39] + umask 022
[00:01:39] + cd /root/rpmbuild/BUILD
[00:01:39] + cd pykolab-0.8.9
[00:01:39] + DOCDIR=/root/rpmbuild/BUILDROOT/pykolab-0.8.9-107.tbits20190107.el7.x86_64/usr/share/doc/pykolab-telemetry-0.8.9
[00:01:39] + export DOCDIR
[00:01:39] + /usr/bin/mkdir -p /root/rpmbuild/BUILDROOT/pykolab-0.8.9-107.tbits20190107.el7.x86_64/usr/share/doc/pykolab-telemetry-0.8.9
[00:01:39] + cp -pr AUTHORS /root/rpmbuild/BUILDROOT/pykolab-0.8.9-107.tbits20190107.el7.x86_64/usr/share/doc/pykolab-telemetry-0.8.9
[00:01:39] + cp -pr COPYING /root/rpmbuild/BUILDROOT/pykolab-0.8.9-107.tbits20190107.el7.x86_64/usr/share/doc/pykolab-telemetry-0.8.9
[00:01:39] + exit 0
[00:01:39] Provides: pykolab-telemetry = 0.8.9-107.tbits20190107.el7
[00:01:39] Requires(rpmlib): rpmlib(CompressedFileNames) <= 3.0.4-1 rpmlib(FileDigests) <= 4.6.0-1 rpmlib(PartialHardlinkSets) <= 4.0.4-1 rpmlib(PayloadFilesHavePrefix) <= 4.0-1
[00:01:39] Requires: /usr/bin/python python(abi) = 2.7
[00:01:39] Processing files: pykolab-xml-0.8.9-107.tbits20190107.el7.noarch
[00:01:40] Provides: pykolab-xml = 0.8.9-107.tbits20190107.el7
[00:01:40] Requires(rpmlib): rpmlib(CompressedFileNames) <= 3.0.4-1 rpmlib(FileDigests) <= 4.6.0-1 rpmlib(PartialHardlinkSets) <= 4.0.4-1 rpmlib(PayloadFilesHavePrefix) <= 4.0-1
[00:01:40] Requires: python(abi) = 2.7
[00:01:40] Processing files: kolab-cli-0.8.9-107.tbits20190107.el7.noarch
[00:01:42] Provides: kolab-cli = 0.8.9-107.tbits20190107.el7
[00:01:42] Requires(rpmlib): rpmlib(CompressedFileNames) <= 3.0.4-1 rpmlib(FileDigests) <= 4.6.0-1 rpmlib(PartialHardlinkSets) <= 4.0.4-1 rpmlib(PayloadFilesHavePrefix) <= 4.0-1
[00:01:42] Requires: /usr/bin/python python(abi) = 2.7
[00:01:42] Processing files: kolab-saslauthd-0.8.9-107.tbits20190107.el7.noarch
[00:01:42] Executing(%doc): /bin/sh -e /var/tmp/rpm-tmp.W3qrzq
[00:01:42] + umask 022
[00:01:42] + cd /root/rpmbuild/BUILD
[00:01:42] + cd pykolab-0.8.9
[00:01:42] + DOCDIR=/root/rpmbuild/BUILDROOT/pykolab-0.8.9-107.tbits20190107.el7.x86_64/usr/share/doc/kolab-saslauthd-0.8.9
[00:01:42] + export DOCDIR
[00:01:42] + /usr/bin/mkdir -p /root/rpmbuild/BUILDROOT/pykolab-0.8.9-107.tbits20190107.el7.x86_64/usr/share/doc/kolab-saslauthd-0.8.9
[00:01:42] + cp -pr AUTHORS /root/rpmbuild/BUILDROOT/pykolab-0.8.9-107.tbits20190107.el7.x86_64/usr/share/doc/kolab-saslauthd-0.8.9
[00:01:42] + cp -pr COPYING /root/rpmbuild/BUILDROOT/pykolab-0.8.9-107.tbits20190107.el7.x86_64/usr/share/doc/kolab-saslauthd-0.8.9
[00:01:42] + exit 0
[00:01:42] Provides: config(kolab-saslauthd) = 0.8.9-107.tbits20190107.el7 kolab-saslauthd = 0.8.9-107.tbits20190107.el7
[00:01:42] Requires(interp): /bin/sh /bin/sh
[00:01:42] Requires(rpmlib): rpmlib(CompressedFileNames) <= 3.0.4-1 rpmlib(FileDigests) <= 4.6.0-1 rpmlib(PartialHardlinkSets) <= 4.0.4-1 rpmlib(PayloadFilesHavePrefix) <= 4.0-1
[00:01:42] Requires(post): /bin/sh
[00:01:42] Requires(preun): /bin/sh
[00:01:42] Requires: /usr/bin/python python(abi) = 2.7
[00:01:42] Processing files: kolab-server-0.8.9-107.tbits20190107.el7.noarch
[00:01:42] Executing(%doc): /bin/sh -e /var/tmp/rpm-tmp.VZtCza
[00:01:42] + umask 022
[00:01:42] + cd /root/rpmbuild/BUILD
[00:01:42] + cd pykolab-0.8.9
[00:01:42] + DOCDIR=/root/rpmbuild/BUILDROOT/pykolab-0.8.9-107.tbits20190107.el7.x86_64/usr/share/doc/kolab-server-0.8.9
[00:01:42] + export DOCDIR
[00:01:42] + /usr/bin/mkdir -p /root/rpmbuild/BUILDROOT/pykolab-0.8.9-107.tbits20190107.el7.x86_64/usr/share/doc/kolab-server-0.8.9
[00:01:42] + cp -pr AUTHORS /root/rpmbuild/BUILDROOT/pykolab-0.8.9-107.tbits20190107.el7.x86_64/usr/share/doc/kolab-server-0.8.9
[00:01:42] + cp -pr COPYING /root/rpmbuild/BUILDROOT/pykolab-0.8.9-107.tbits20190107.el7.x86_64/usr/share/doc/kolab-server-0.8.9
[00:01:42] + exit 0
[00:01:42] warning: File listed twice: /run/kolabd
[00:01:42] Provides: config(kolab-server) = 0.8.9-107.tbits20190107.el7 kolab-server = 0.8.9-107.tbits20190107.el7
[00:01:42] Requires(interp): /bin/sh /bin/sh
[00:01:42] Requires(rpmlib): rpmlib(CompressedFileNames) <= 3.0.4-1 rpmlib(FileDigests) <= 4.6.0-1 rpmlib(PartialHardlinkSets) <= 4.0.4-1 rpmlib(PayloadFilesHavePrefix) <= 4.0-1
[00:01:42] Requires(post): /bin/sh
[00:01:42] Requires(preun): /bin/sh
[00:01:42] Requires: /usr/bin/python python(abi) = 2.7
[00:01:42] Processing files: postfix-kolab-0.8.9-107.tbits20190107.el7.noarch
[00:01:42] Executing(%doc): /bin/sh -e /var/tmp/rpm-tmp.71ZB4U
[00:01:42] + umask 022
[00:01:42] + cd /root/rpmbuild/BUILD
[00:01:42] + cd pykolab-0.8.9
[00:01:42] + DOCDIR=/root/rpmbuild/BUILDROOT/pykolab-0.8.9-107.tbits20190107.el7.x86_64/usr/share/doc/postfix-kolab-0.8.9
[00:01:42] + export DOCDIR
[00:01:42] + /usr/bin/mkdir -p /root/rpmbuild/BUILDROOT/pykolab-0.8.9-107.tbits20190107.el7.x86_64/usr/share/doc/postfix-kolab-0.8.9
[00:01:42] + cp -pr AUTHORS /root/rpmbuild/BUILDROOT/pykolab-0.8.9-107.tbits20190107.el7.x86_64/usr/share/doc/postfix-kolab-0.8.9
[00:01:42] + cp -pr COPYING /root/rpmbuild/BUILDROOT/pykolab-0.8.9-107.tbits20190107.el7.x86_64/usr/share/doc/postfix-kolab-0.8.9
[00:01:42] + exit 0
[00:01:42] Provides: postfix-kolab = 0.8.9-107.tbits20190107.el7
[00:01:42] Requires(rpmlib): rpmlib(CompressedFileNames) <= 3.0.4-1 rpmlib(FileDigests) <= 4.6.0-1 rpmlib(PayloadFilesHavePrefix) <= 4.0-1
[00:01:42] Requires: /usr/bin/python
[00:01:42] Processing files: wallace-0.8.9-107.tbits20190107.el7.noarch
[00:01:42] Executing(%doc): /bin/sh -e /var/tmp/rpm-tmp.rKbtJF
[00:01:42] + umask 022
[00:01:42] + cd /root/rpmbuild/BUILD
[00:01:42] + cd pykolab-0.8.9
[00:01:42] + DOCDIR=/root/rpmbuild/BUILDROOT/pykolab-0.8.9-107.tbits20190107.el7.x86_64/usr/share/doc/wallace-0.8.9
[00:01:42] + export DOCDIR
[00:01:42] + /usr/bin/mkdir -p /root/rpmbuild/BUILDROOT/pykolab-0.8.9-107.tbits20190107.el7.x86_64/usr/share/doc/wallace-0.8.9
[00:01:42] + cp -pr AUTHORS /root/rpmbuild/BUILDROOT/pykolab-0.8.9-107.tbits20190107.el7.x86_64/usr/share/doc/wallace-0.8.9
[00:01:42] + cp -pr COPYING /root/rpmbuild/BUILDROOT/pykolab-0.8.9-107.tbits20190107.el7.x86_64/usr/share/doc/wallace-0.8.9
[00:01:42] + exit 0
[00:01:43] Provides: config(wallace) = 0.8.9-107.tbits20190107.el7 wallace = 0.8.9-107.tbits20190107.el7
[00:01:43] Requires(interp): /bin/sh /bin/sh
[00:01:43] Requires(rpmlib): rpmlib(CompressedFileNames) <= 3.0.4-1 rpmlib(FileDigests) <= 4.6.0-1 rpmlib(PartialHardlinkSets) <= 4.0.4-1 rpmlib(PayloadFilesHavePrefix) <= 4.0-1
[00:01:43] Requires(post): /bin/sh
[00:01:43] Requires(preun): /bin/sh
[00:01:43] Requires: /usr/bin/python python(abi) = 2.7
[00:01:43] Checking for unpackaged file(s): /usr/lib/rpm/check-files /root/rpmbuild/BUILDROOT/pykolab-0.8.9-107.tbits20190107.el7.x86_64
[00:01:43] Wrote: /root/rpmbuild/SRPMS/pykolab-0.8.9-107.tbits20190107.el7.src.rpm
[00:01:43] Wrote: /root/rpmbuild/RPMS/noarch/pykolab-0.8.9-107.tbits20190107.el7.noarch.rpm
[00:01:43] Wrote: /root/rpmbuild/RPMS/noarch/pykolab-telemetry-0.8.9-107.tbits20190107.el7.noarch.rpm
[00:01:43] Wrote: /root/rpmbuild/RPMS/noarch/pykolab-xml-0.8.9-107.tbits20190107.el7.noarch.rpm
[00:01:43] Wrote: /root/rpmbuild/RPMS/noarch/kolab-cli-0.8.9-107.tbits20190107.el7.noarch.rpm
[00:01:43] Wrote: /root/rpmbuild/RPMS/noarch/kolab-saslauthd-0.8.9-107.tbits20190107.el7.noarch.rpm
[00:01:43] Wrote: /root/rpmbuild/RPMS/noarch/kolab-server-0.8.9-107.tbits20190107.el7.noarch.rpm
[00:01:43] Wrote: /root/rpmbuild/RPMS/noarch/postfix-kolab-0.8.9-107.tbits20190107.el7.noarch.rpm
[00:01:43] Wrote: /root/rpmbuild/RPMS/noarch/wallace-0.8.9-107.tbits20190107.el7.noarch.rpm
[00:01:43] Executing(%clean): /bin/sh -e /var/tmp/rpm-tmp.BxrHXv
[00:01:43] + umask 022
[00:01:43] + cd /root/rpmbuild/BUILD
[00:01:43] + cd pykolab-0.8.9
[00:01:43] + rm -rf /root/rpmbuild/BUILDROOT/pykolab-0.8.9-107.tbits20190107.el7.x86_64
[00:01:43] + exit 0
[00:01:43] 0
[00:01:43] now running: ssh -f -o "StrictHostKeyChecking no" -o Port=22 -i /etc/lightbuildserver/container/container_rsa root@10.0.3.5 "export LC_ALL=C; (mkdir -p ~/repo/src) 2>&1 && echo \$?"
[00:01:43] 0
[00:01:43] now running: ssh -f -o "StrictHostKeyChecking no" -o Port=22 -i /etc/lightbuildserver/container/container_rsa root@10.0.3.5 "export LC_ALL=C; (cp ~/rpmbuild/SRPMS/*.src.rpm ~/repo/src) 2>&1 && echo \$?"
[00:01:44] 0
[00:01:44] now running: ssh -f -o "StrictHostKeyChecking no" -o Port=22 -i /etc/lightbuildserver/container/container_rsa root@10.0.3.5 "export LC_ALL=C; (cp -R ~/rpmbuild/RPMS/* ~/repo) 2>&1 && echo \$?"
[00:01:44] 0
[00:01:44] now running: ssh -f -o "StrictHostKeyChecking no" -o Port=22 -i /etc/lightbuildserver/container/container_rsa root@10.0.3.5 "export LC_ALL=C; (cd repo && createrepo .) 2>&1 && echo \$?"
[00:01:45] Spawning worker 0 with 32 pkgs
[00:01:45] Spawning worker 1 with 32 pkgs
[00:01:45] Workers Finished
[00:01:45] Saving Primary metadata
[00:01:45] Saving file lists metadata
[00:01:45] Saving other metadata
[00:01:45] Generating sqlite DBs
[00:01:45] Sqlite DBs complete
[00:01:45] 0
[00:01:45] now running: rsync -avz --delete -e "ssh -i /etc/lightbuildserver/container/container_rsa -p 2222" root@build04lxc.lbs.solidcharity.com:/mnt/var/lib/lightbuildserver/repos/tbits.net/TBitsKolab16Test/centos/7 /var/lib/lightbuildserver/repos/tbits.net/TBitsKolab16Test/centos
[00:01:45] receiving incremental file list
[00:01:45] deleting 7/repodata/cabb7fde1390678d70719173b9318d2e41d2ad7a7c9a4e961e4d5eef990d1d0f-primary.sqlite.bz2
[00:01:45] deleting 7/repodata/6d830ee44907c1da8437b663b3aa976dbae10b337e877ce35e066b1c45bf662d-other.sqlite.bz2
[00:01:45] deleting 7/repodata/6c560ac3a426400deb74ae30915f11e1063c13c346f73ce8ca26168bfc488f53-primary.xml.gz
[00:01:45] deleting 7/repodata/35d2a333659365cbfc7abc1b890280ddcebf2eb16197a2513b6dfcba67c92d3a-other.xml.gz
[00:01:45] deleting 7/repodata/353ad9f81bc22901af84bb204257acf4dc3d3567c5afc015860cd61a7a36daf8-filelists.sqlite.bz2
[00:01:45] deleting 7/repodata/1852723c0e6cd13dedafe63a0aaa50a6fc15aa013e36018a7b5d3c0e3f8600df-filelists.xml.gz
[00:01:45] 7/
[00:01:45] 7/noarch/
[00:01:45] 7/noarch/kolab-cli-0.8.9-107.tbits20190107.el7.noarch.rpm
[00:01:45] 7/noarch/kolab-saslauthd-0.8.9-107.tbits20190107.el7.noarch.rpm
[00:01:45] 7/noarch/kolab-server-0.8.9-107.tbits20190107.el7.noarch.rpm
[00:01:45] 7/noarch/postfix-kolab-0.8.9-107.tbits20190107.el7.noarch.rpm
[00:01:45] 7/noarch/pykolab-0.8.9-107.tbits20190107.el7.noarch.rpm
[00:01:45] 7/noarch/pykolab-telemetry-0.8.9-107.tbits20190107.el7.noarch.rpm
[00:01:45] 7/noarch/pykolab-xml-0.8.9-107.tbits20190107.el7.noarch.rpm
[00:01:45] 7/noarch/wallace-0.8.9-107.tbits20190107.el7.noarch.rpm
[00:01:45] 7/repodata/
[00:01:45] 7/repodata/229e4d17d1133da289d80c631b46b9d83c503cf6d53fe36fcd1c285cad7d83f9-other.sqlite.bz2
[00:01:45] 7/repodata/371d289fc466c272d40325ff58614b86e4c23fac023c406ff627661d65381944-filelists.xml.gz
[00:01:45] 7/repodata/37a907eda569dcb2c118e5c2a80ccaf14a1aa5ecdb5877521b19eb6e5d1223ae-primary.sqlite.bz2
[00:01:45] 7/repodata/50610dfcc09d9b6f9dfa93b34d411628764ae5f1798449a01c8cdca8019d29d8-primary.xml.gz
[00:01:45] 7/repodata/6bb1495e4aff351ecd28c29ac04aa9e4ee0310fd0beccf9b8fef1cf4511a4dc1-filelists.sqlite.bz2
[00:01:45] 7/repodata/e39975ed8f0132f834d400d58b64e157e86df478cb28a88fa3538b2c83f9eaa3-other.xml.gz
[00:01:45] 7/repodata/repomd.xml
[00:01:45] 7/src/
[00:01:45] 7/src/pykolab-0.8.9-107.tbits20190107.el7.src.rpm
[00:01:45] 
[00:01:45] sent 387 bytes  received 1,281,737 bytes  854,749.33 bytes/sec
[00:01:45] total size is 45,112,456  speedup is 35.19
[00:01:45] now running: rsync -avz --delete -e "ssh -i /etc/lightbuildserver/container/container_rsa -p 2222" root@build04lxc.lbs.solidcharity.com:/mnt/var/lib/lightbuildserver/tarballs/tbits.net/TBitsKolab16Test /var/lib/lightbuildserver/tarballs/tbits.net
[00:01:45] receiving incremental file list
[00:01:45] 
[00:01:45] sent 25 bytes  received 68 bytes  186.00 bytes/sec
[00:01:45] total size is 0  speedup is 0.00
[00:01:45] Success!
[00:02:00] This build took about 2 minutes

	
go to top of this page