Build Result for tbits.net/TBitsKolab16Test/roundcubemail-plugin-ude_login/TBitsKolab16Test

go to bottom of this page
[00:00:00]  * Starting at 2019-01-07 22:31:08 GMT+0100
[00:00:00]  * Preparing the machine...
[00:00:01] now running: ssh -f -o "StrictHostKeyChecking no" -p 2222 -i /etc/lightbuildserver/container/container_rsa root@build04lxc.lbs.solidcharity.com "export LC_ALL=C; (if [ -d /var/lib/lxc/005-build04lxc.lbs.solidcharity.com ]; then lxc-destroy --name 005-build04lxc.lbs.solidcharity.com; fi) 2>&1; echo \$?"
[00:00:02] lxc-destroy: 005-build04lxc.lbs.solidcharity.com: tools/lxc_destroy.c: main: 271 Destroyed container 005-build04lxc.lbs.solidcharity.com
[00:00:02] 0
[00:00:02] now running: ssh -f -o "StrictHostKeyChecking no" -p 2222 -i /etc/lightbuildserver/container/container_rsa root@build04lxc.lbs.solidcharity.com "export LC_ALL=C; (/usr/share/lxc-scripts/initLXC.sh) 2>&1; echo \$?"
[00:00:03] patching file lxc-fedora
[00:00:03] Hunk #1 FAILED at 562.
[00:00:03] Hunk #2 FAILED at 570.
[00:00:03] Hunk #3 FAILED at 647.
[00:00:03] Hunk #4 FAILED at 680.
[00:00:03] Hunk #5 FAILED at 813.
[00:00:03] Hunk #6 succeeded at 1274 (offset 83 lines).
[00:00:03] 5 out of 6 hunks FAILED -- saving rejects to file lxc-fedora.rej
[00:00:03] patching file lxc-fedora
[00:00:03] Hunk #1 FAILED at 687.
[00:00:03] Hunk #2 FAILED at 695.
[00:00:03] Hunk #3 FAILED at 809.
[00:00:03] Hunk #4 FAILED at 1016.
[00:00:03] 4 out of 4 hunks FAILED -- saving rejects to file lxc-fedora.rej
[00:00:03] 0
[00:00:03] now running: ssh -f -o "StrictHostKeyChecking no" -p 2222 -i /etc/lightbuildserver/container/container_rsa root@build04lxc.lbs.solidcharity.com "export LC_ALL=C; (/usr/share/lxc-scripts/initCentOS.sh 005-build04lxc.lbs.solidcharity.com 5 7 amd64 0) 2>&1; echo \$?"
[00:00:04] Using image from local cache
[00:00:04] Unpacking the rootfs
[00:00:10] 
[00:00:10] ---
[00:00:10] You just created a CentOS container (release=7, arch=amd64, variant=default)
[00:00:10] 
[00:00:10] To enable sshd, run: yum install openssh-server
[00:00:10] 
[00:00:10] For security reason, container images ship without user accounts
[00:00:10] and without a root password.
[00:00:10] 
[00:00:10] Use lxc-attach or chroot directly into the rootfs to set a root password
[00:00:10] or create user accounts.
[00:00:10] Host 10.0.3.5 not found in /root/.ssh/known_hosts
[00:00:10] /root
[00:00:10] Loaded plugins: fastestmirror
[00:00:11] Determining fastest mirrors
[00:00:11]  * base: ftp.plusline.net
[00:00:11]  * extras: mirror.fra10.de.leaseweb.net
[00:00:11]  * updates: mirror.fra10.de.leaseweb.net
[00:00:14] Resolving Dependencies
[00:00:14] --> Running transaction check
[00:00:14] ---> Package openssh-server.x86_64 0:7.4p1-16.el7 will be installed
[00:00:14] --> Finished Dependency Resolution
[00:00:14] 
[00:00:14] Dependencies Resolved
[00:00:14] 
[00:00:14] ================================================================================
[00:00:14]  Package                Arch           Version               Repository    Size
[00:00:14] ================================================================================
[00:00:14] Installing:
[00:00:14]  openssh-server         x86_64         7.4p1-16.el7          base         458 k
[00:00:14] 
[00:00:14] Transaction Summary
[00:00:14] ================================================================================
[00:00:14] Install  1 Package
[00:00:14] 
[00:00:14] Total download size: 458 k
[00:00:14] Installed size: 971 k
[00:00:14] Downloading packages:
[00:00:14] warning: [fd 19]: Header V3 RSA/SHA256 Signature, key ID f4a80eb5: NOKEY
[00:00:14] Public key for openssh-server-7.4p1-16.el7.x86_64.rpm is not installed
[00:00:14] Retrieving key from file:///etc/pki/rpm-gpg/RPM-GPG-KEY-CentOS-7
[00:00:14] Importing GPG key 0xF4A80EB5:
[00:00:14]  Userid     : "CentOS-7 Key (CentOS 7 Official Signing Key) <security@centos.org>"
[00:00:15]  Fingerprint: 6341 ab27 53d7 8a78 a7c2 7bb1 24c6 a8a7 f4a8 0eb5
[00:00:15]  Package    : centos-release-7-6.1810.2.el7.centos.x86_64 (@base)
[00:00:15]  From       : /etc/pki/rpm-gpg/RPM-GPG-KEY-CentOS-7
[00:00:15] Running transaction check
[00:00:15] Running transaction test
[00:00:15] Transaction test succeeded
[00:00:15] Running transaction
[00:00:15]   Installing : openssh-server-7.4p1-16.el7.x86_64                           1/1 
[00:00:15]   Verifying  : openssh-server-7.4p1-16.el7.x86_64                           1/1 
[00:00:15] 
[00:00:15] Installed:
[00:00:15]   openssh-server.x86_64 0:7.4p1-16.el7                                          
[00:00:15] 
[00:00:15] Complete!
[00:00:15] Removing password for user root.
[00:00:15] passwd: Success
[00:00:15] To setup port forwarding from outside, please run:
[00:00:15] ./tunnelport.sh 5 22
[00:00:15] ./initWebproxy.sh 5 www.005-build04lxc.lbs.solidcharity.com.de
[00:00:15] 
[00:00:15] To start the container, run: lxc-start -d -n 005-build04lxc.lbs.solidcharity.com
[00:00:15] 
[00:00:15] To connect to the container locally, run: eval `ssh-agent`; ssh-add; ssh root@10.0.3.5
[00:00:15] 0
[00:00:15] now running: ssh -f -o "StrictHostKeyChecking no" -p 2222 -i /etc/lightbuildserver/container/container_rsa root@build04lxc.lbs.solidcharity.com "export LC_ALL=C; (/usr/share/lxc-scripts/tunnelport.sh 5 22) 2>&1; echo \$?"
[00:00:16] outward interface: ens18
[00:00:16] outward IP address: 80.241.214.124
[00:00:16] bridge interface: lxcbr0
[00:00:16] bridge address: 10.0.3.1
[00:00:16] guestip: 10.0.3.5
[00:00:16] there is already a mapping for port  2005
[00:00:16] 0
[00:00:16] now running: ssh -f -o "StrictHostKeyChecking no" -p 2222 -i /etc/lightbuildserver/container/container_rsa root@build04lxc.lbs.solidcharity.com "export LC_ALL=C; (mkdir -p /var/lib/lxc/005-build04lxc.lbs.solidcharity.com/rootfs/root/.ssh/) 2>&1; echo \$?"
[00:00:16] 0
[00:00:16] now running: echo "put /etc/lightbuildserver/container/container_rsa.pub authorized_keys2" | sftp -o "StrictHostKeyChecking no" -oPort=2222 -i /etc/lightbuildserver/container/container_rsa root@build04lxc.lbs.solidcharity.com:/var/lib/lxc/005-build04lxc.lbs.solidcharity.com/rootfs/root/.ssh/
[00:00:16] Connected to build04lxc.lbs.solidcharity.com.
[00:00:16] Changing to: /var/lib/lxc/005-build04lxc.lbs.solidcharity.com/rootfs/root/.ssh/
[00:00:16] sftp> put /etc/lightbuildserver/container/container_rsa.pub authorized_keys2
[00:00:16] Uploading /etc/lightbuildserver/container/container_rsa.pub to /var/lib/lxc/005-build04lxc.lbs.solidcharity.com/rootfs/root/.ssh/authorized_keys2
[00:00:16] now running: ssh -f -o "StrictHostKeyChecking no" -p 2222 -i /etc/lightbuildserver/container/container_rsa root@build04lxc.lbs.solidcharity.com "export LC_ALL=C; (cd /var/lib/lxc/005-build04lxc.lbs.solidcharity.com/rootfs/root/.ssh/ && cat authorized_keys2 >> authorized_keys && rm authorized_keys2) 2>&1; echo \$?"
[00:00:17] 0
[00:00:17] now running: ssh -f -o "StrictHostKeyChecking no" -p 2222 -i /etc/lightbuildserver/container/container_rsa root@build04lxc.lbs.solidcharity.com "export LC_ALL=C; (chmod 700 /var/lib/lxc/005-build04lxc.lbs.solidcharity.com/rootfs/root/.ssh/ && chmod 600 /var/lib/lxc/005-build04lxc.lbs.solidcharity.com/rootfs/root/.ssh/authorized_keys) 2>&1; echo \$?"
[00:00:17] 0
[00:00:17] now running: ssh -f -o "StrictHostKeyChecking no" -p 2222 -i /etc/lightbuildserver/container/container_rsa root@build04lxc.lbs.solidcharity.com "export LC_ALL=C; (/usr/share/lxc-scripts/initMount.sh /mnt/var/lib/lightbuildserver/repos/tbits.net/TBitsKolab16Test/centos/7 005-build04lxc.lbs.solidcharity.com /root/repo) 2>&1; echo \$?"
[00:00:17] 0
[00:00:17] now running: rsync -avz --delete -e "ssh -i /etc/lightbuildserver/container/container_rsa -p 2222" /var/lib/lightbuildserver/repos/tbits.net/TBitsKolab16Test/centos/7 root@build04lxc.lbs.solidcharity.com:/mnt/var/lib/lightbuildserver/repos/tbits.net/TBitsKolab16Test/centos
[00:00:18] sending incremental file list
[00:00:18] 7/lbs-tbits.net-TBitsKolab16Test.repo
[00:00:18] 7/repodata/
[00:00:18] 
[00:00:18] sent 12,343 bytes  received 80 bytes  24,846.00 bytes/sec
[00:00:18] total size is 69,733,841  speedup is 5,613.29
[00:00:18] now running: ssh -f -o "StrictHostKeyChecking no" -p 2222 -i /etc/lightbuildserver/container/container_rsa root@build04lxc.lbs.solidcharity.com "export LC_ALL=C; (/usr/share/lxc-scripts/initMount.sh /mnt/var/lib/lightbuildserver/tarballs/tbits.net/TBitsKolab16Test 005-build04lxc.lbs.solidcharity.com /root/tarball) 2>&1; echo \$?"
[00:00:18] 0
[00:00:18] now running: rsync -avz --delete -e "ssh -i /etc/lightbuildserver/container/container_rsa -p 2222" /var/lib/lightbuildserver/tarballs/tbits.net/TBitsKolab16Test root@build04lxc.lbs.solidcharity.com:/mnt/var/lib/lightbuildserver/tarballs/tbits.net
[00:00:18] sending incremental file list
[00:00:18] 
[00:00:18] sent 80 bytes  received 17 bytes  64.67 bytes/sec
[00:00:18] total size is 0  speedup is 0.00
[00:00:18] now running: ssh -f -o "StrictHostKeyChecking no" -p 2222 -i /etc/lightbuildserver/container/container_rsa root@build04lxc.lbs.solidcharity.com "export LC_ALL=C; (lxc-start -d -n 005-build04lxc.lbs.solidcharity.com) 2>&1; echo \$?"
[00:00:19] 0
[00:00:19] now running: ssh-keygen -f "/run/uwsgi/.ssh/known_hosts" -R 10.0.3.5
[00:00:19] # Host 10.0.3.5 found: line 7
[00:00:19] /run/uwsgi/.ssh/known_hosts updated.
[00:00:19] Original contents retained as /run/uwsgi/.ssh/known_hosts.old
[00:00:19] now running: ssh -f -o "StrictHostKeyChecking no" -o Port=22 -i /etc/lightbuildserver/container/container_rsa root@10.0.3.5 "export LC_ALL=C; (echo "container is running") 2>&1 && echo \$?"
[00:00:20] Warning: Permanently added '10.0.3.5' (ECDSA) to the list of known hosts.
[00:00:20] container is running
[00:00:20] 0
[00:00:20] container has been started successfully
[00:00:20] now running: ssh -f -o "StrictHostKeyChecking no" -o Port=22 -i /etc/lightbuildserver/container/container_rsa root@10.0.3.5 "export LC_ALL=C; (yum -y install tar createrepo gcc rpm-build rpm-sign gnupg make curl iptables rsync perl iproute yum-utils yum-plugin-priorities) 2>&1 && echo \$?"
[00:00:20] Loaded plugins: fastestmirror
[00:00:20] Loading mirror speeds from cached hostfile
[00:00:21]  * base: centos.copahost.com
[00:00:21]  * extras: centos.mirror.net-d-sign.de
[00:00:21]  * updates: ftp.plusline.net
[00:00:21] Package 2:tar-1.26-35.el7.x86_64 already installed and latest version
[00:00:21] Package gnupg2-2.0.22-5.el7_5.x86_64 already installed and latest version
[00:00:21] Package curl-7.29.0-51.el7.x86_64 already installed and latest version
[00:00:21] Package iptables-1.4.21-28.el7.x86_64 already installed and latest version
[00:00:21] Package iproute-4.11.0-14.el7.x86_64 already installed and latest version
[00:00:21] Resolving Dependencies
[00:00:21] --> Running transaction check
[00:00:21] ---> Package createrepo.noarch 0:0.9.9-28.el7 will be installed
[00:00:21] --> Processing Dependency: python-deltarpm for package: createrepo-0.9.9-28.el7.noarch
[00:00:21] --> Processing Dependency: libxml2-python for package: createrepo-0.9.9-28.el7.noarch
[00:00:21] --> Processing Dependency: deltarpm for package: createrepo-0.9.9-28.el7.noarch
[00:00:21] ---> Package gcc.x86_64 0:4.8.5-36.el7 will be installed
[00:00:21] --> Processing Dependency: libgomp = 4.8.5-36.el7 for package: gcc-4.8.5-36.el7.x86_64
[00:00:21] --> Processing Dependency: cpp = 4.8.5-36.el7 for package: gcc-4.8.5-36.el7.x86_64
[00:00:21] --> Processing Dependency: glibc-devel >= 2.2.90-12 for package: gcc-4.8.5-36.el7.x86_64
[00:00:21] --> Processing Dependency: libmpfr.so.4()(64bit) for package: gcc-4.8.5-36.el7.x86_64
[00:00:21] --> Processing Dependency: libmpc.so.3()(64bit) for package: gcc-4.8.5-36.el7.x86_64
[00:00:21] --> Processing Dependency: libgomp.so.1()(64bit) for package: gcc-4.8.5-36.el7.x86_64
[00:00:21] ---> Package make.x86_64 1:3.82-23.el7 will be installed
[00:00:21] ---> Package perl.x86_64 4:5.16.3-293.el7 will be installed
[00:00:21] --> Processing Dependency: perl-libs = 4:5.16.3-293.el7 for package: 4:perl-5.16.3-293.el7.x86_64
[00:00:21] --> Processing Dependency: perl(Socket) >= 1.3 for package: 4:perl-5.16.3-293.el7.x86_64
[00:00:21] --> Processing Dependency: perl(Scalar::Util) >= 1.10 for package: 4:perl-5.16.3-293.el7.x86_64
[00:00:21] --> Processing Dependency: perl-macros for package: 4:perl-5.16.3-293.el7.x86_64
[00:00:21] --> Processing Dependency: perl-libs for package: 4:perl-5.16.3-293.el7.x86_64
[00:00:21] --> Processing Dependency: perl(threads::shared) for package: 4:perl-5.16.3-293.el7.x86_64
[00:00:21] --> Processing Dependency: perl(threads) for package: 4:perl-5.16.3-293.el7.x86_64
[00:00:21] --> Processing Dependency: perl(constant) for package: 4:perl-5.16.3-293.el7.x86_64
[00:00:21] --> Processing Dependency: perl(Time::Local) for package: 4:perl-5.16.3-293.el7.x86_64
[00:00:21] --> Processing Dependency: perl(Time::HiRes) for package: 4:perl-5.16.3-293.el7.x86_64
[00:00:21] --> Processing Dependency: perl(Storable) for package: 4:perl-5.16.3-293.el7.x86_64
[00:00:21] --> Processing Dependency: perl(Socket) for package: 4:perl-5.16.3-293.el7.x86_64
[00:00:21] --> Processing Dependency: perl(Scalar::Util) for package: 4:perl-5.16.3-293.el7.x86_64
[00:00:21] --> Processing Dependency: perl(Pod::Simple::XHTML) for package: 4:perl-5.16.3-293.el7.x86_64
[00:00:21] --> Processing Dependency: perl(Pod::Simple::Search) for package: 4:perl-5.16.3-293.el7.x86_64
[00:00:21] --> Processing Dependency: perl(Getopt::Long) for package: 4:perl-5.16.3-293.el7.x86_64
[00:00:21] --> Processing Dependency: perl(Filter::Util::Call) for package: 4:perl-5.16.3-293.el7.x86_64
[00:00:21] --> Processing Dependency: perl(File::Temp) for package: 4:perl-5.16.3-293.el7.x86_64
[00:00:21] --> Processing Dependency: perl(File::Spec::Unix) for package: 4:perl-5.16.3-293.el7.x86_64
[00:00:21] --> Processing Dependency: perl(File::Spec::Functions) for package: 4:perl-5.16.3-293.el7.x86_64
[00:00:21] --> Processing Dependency: perl(File::Spec) for package: 4:perl-5.16.3-293.el7.x86_64
[00:00:21] --> Processing Dependency: perl(File::Path) for package: 4:perl-5.16.3-293.el7.x86_64
[00:00:21] --> Processing Dependency: perl(Exporter) for package: 4:perl-5.16.3-293.el7.x86_64
[00:00:21] --> Processing Dependency: perl(Cwd) for package: 4:perl-5.16.3-293.el7.x86_64
[00:00:21] --> Processing Dependency: perl(Carp) for package: 4:perl-5.16.3-293.el7.x86_64
[00:00:21] --> Processing Dependency: libperl.so()(64bit) for package: 4:perl-5.16.3-293.el7.x86_64
[00:00:21] ---> Package rpm-build.x86_64 0:4.11.3-35.el7 will be installed
[00:00:21] --> Processing Dependency: patch >= 2.5 for package: rpm-build-4.11.3-35.el7.x86_64
[00:00:21] --> Processing Dependency: elfutils >= 0.128 for package: rpm-build-4.11.3-35.el7.x86_64
[00:00:21] --> Processing Dependency: unzip for package: rpm-build-4.11.3-35.el7.x86_64
[00:00:21] --> Processing Dependency: system-rpm-config for package: rpm-build-4.11.3-35.el7.x86_64
[00:00:21] --> Processing Dependency: perl(Thread::Queue) for package: rpm-build-4.11.3-35.el7.x86_64
[00:00:21] --> Processing Dependency: file for package: rpm-build-4.11.3-35.el7.x86_64
[00:00:21] --> Processing Dependency: bzip2 for package: rpm-build-4.11.3-35.el7.x86_64
[00:00:21] --> Processing Dependency: /usr/bin/gdb-add-index for package: rpm-build-4.11.3-35.el7.x86_64
[00:00:21] ---> Package rpm-sign.x86_64 0:4.11.3-35.el7 will be installed
[00:00:21] ---> Package rsync.x86_64 0:3.1.2-4.el7 will be installed
[00:00:21] ---> Package yum-plugin-priorities.noarch 0:1.1.31-50.el7 will be installed
[00:00:21] ---> Package yum-utils.noarch 0:1.1.31-50.el7 will be installed
[00:00:21] --> Processing Dependency: python-kitchen for package: yum-utils-1.1.31-50.el7.noarch
[00:00:21] --> Running transaction check
[00:00:21] ---> Package bzip2.x86_64 0:1.0.6-13.el7 will be installed
[00:00:21] ---> Package cpp.x86_64 0:4.8.5-36.el7 will be installed
[00:00:21] ---> Package deltarpm.x86_64 0:3.6-3.el7 will be installed
[00:00:21] ---> Package elfutils.x86_64 0:0.172-2.el7 will be installed
[00:00:21] ---> Package file.x86_64 0:5.11-35.el7 will be installed
[00:00:21] ---> Package gdb.x86_64 0:7.6.1-114.el7 will be installed
[00:00:21] ---> Package glibc-devel.x86_64 0:2.17-260.el7 will be installed
[00:00:22] --> Processing Dependency: glibc-headers = 2.17-260.el7 for package: glibc-devel-2.17-260.el7.x86_64
[00:00:22] --> Processing Dependency: glibc-headers for package: glibc-devel-2.17-260.el7.x86_64
[00:00:22] ---> Package libgomp.x86_64 0:4.8.5-36.el7 will be installed
[00:00:22] ---> Package libmpc.x86_64 0:1.0.1-3.el7 will be installed
[00:00:22] ---> Package libxml2-python.x86_64 0:2.9.1-6.el7_2.3 will be installed
[00:00:22] ---> Package mpfr.x86_64 0:3.1.1-4.el7 will be installed
[00:00:22] ---> Package patch.x86_64 0:2.7.1-10.el7_5 will be installed
[00:00:22] ---> Package perl-Carp.noarch 0:1.26-244.el7 will be installed
[00:00:22] ---> Package perl-Exporter.noarch 0:5.68-3.el7 will be installed
[00:00:22] ---> Package perl-File-Path.noarch 0:2.09-2.el7 will be installed
[00:00:22] ---> Package perl-File-Temp.noarch 0:0.23.01-3.el7 will be installed
[00:00:22] ---> Package perl-Filter.x86_64 0:1.49-3.el7 will be installed
[00:00:22] ---> Package perl-Getopt-Long.noarch 0:2.40-3.el7 will be installed
[00:00:22] --> Processing Dependency: perl(Pod::Usage) >= 1.14 for package: perl-Getopt-Long-2.40-3.el7.noarch
[00:00:22] --> Processing Dependency: perl(Text::ParseWords) for package: perl-Getopt-Long-2.40-3.el7.noarch
[00:00:22] ---> Package perl-PathTools.x86_64 0:3.40-5.el7 will be installed
[00:00:22] ---> Package perl-Pod-Simple.noarch 1:3.28-4.el7 will be installed
[00:00:22] --> Processing Dependency: perl(Pod::Escapes) >= 1.04 for package: 1:perl-Pod-Simple-3.28-4.el7.noarch
[00:00:22] --> Processing Dependency: perl(Encode) for package: 1:perl-Pod-Simple-3.28-4.el7.noarch
[00:00:22] ---> Package perl-Scalar-List-Utils.x86_64 0:1.27-248.el7 will be installed
[00:00:22] ---> Package perl-Socket.x86_64 0:2.010-4.el7 will be installed
[00:00:22] ---> Package perl-Storable.x86_64 0:2.45-3.el7 will be installed
[00:00:22] ---> Package perl-Thread-Queue.noarch 0:3.02-2.el7 will be installed
[00:00:22] ---> Package perl-Time-HiRes.x86_64 4:1.9725-3.el7 will be installed
[00:00:22] ---> Package perl-Time-Local.noarch 0:1.2300-2.el7 will be installed
[00:00:22] ---> Package perl-constant.noarch 0:1.27-2.el7 will be installed
[00:00:22] ---> Package perl-libs.x86_64 4:5.16.3-293.el7 will be installed
[00:00:22] ---> Package perl-macros.x86_64 4:5.16.3-293.el7 will be installed
[00:00:22] ---> Package perl-threads.x86_64 0:1.87-4.el7 will be installed
[00:00:22] ---> Package perl-threads-shared.x86_64 0:1.43-6.el7 will be installed
[00:00:22] ---> Package python-deltarpm.x86_64 0:3.6-3.el7 will be installed
[00:00:22] ---> Package python-kitchen.noarch 0:1.1.1-5.el7 will be installed
[00:00:22] --> Processing Dependency: python-chardet for package: python-kitchen-1.1.1-5.el7.noarch
[00:00:22] ---> Package redhat-rpm-config.noarch 0:9.1.0-87.el7.centos will be installed
[00:00:22] --> Processing Dependency: dwz >= 0.4 for package: redhat-rpm-config-9.1.0-87.el7.centos.noarch
[00:00:22] --> Processing Dependency: zip for package: redhat-rpm-config-9.1.0-87.el7.centos.noarch
[00:00:22] --> Processing Dependency: perl-srpm-macros for package: redhat-rpm-config-9.1.0-87.el7.centos.noarch
[00:00:22] ---> Package unzip.x86_64 0:6.0-19.el7 will be installed
[00:00:22] --> Running transaction check
[00:00:22] ---> Package dwz.x86_64 0:0.11-3.el7 will be installed
[00:00:22] ---> Package glibc-headers.x86_64 0:2.17-260.el7 will be installed
[00:00:22] --> Processing Dependency: kernel-headers >= 2.2.1 for package: glibc-headers-2.17-260.el7.x86_64
[00:00:22] --> Processing Dependency: kernel-headers for package: glibc-headers-2.17-260.el7.x86_64
[00:00:22] ---> Package perl-Encode.x86_64 0:2.51-7.el7 will be installed
[00:00:22] ---> Package perl-Pod-Escapes.noarch 1:1.04-293.el7 will be installed
[00:00:22] ---> Package perl-Pod-Usage.noarch 0:1.63-3.el7 will be installed
[00:00:22] --> Processing Dependency: perl(Pod::Text) >= 3.15 for package: perl-Pod-Usage-1.63-3.el7.noarch
[00:00:22] --> Processing Dependency: perl-Pod-Perldoc for package: perl-Pod-Usage-1.63-3.el7.noarch
[00:00:22] ---> Package perl-Text-ParseWords.noarch 0:3.29-4.el7 will be installed
[00:00:22] ---> Package perl-srpm-macros.noarch 0:1-8.el7 will be installed
[00:00:22] ---> Package python-chardet.noarch 0:2.2.1-1.el7_1 will be installed
[00:00:22] ---> Package zip.x86_64 0:3.0-11.el7 will be installed
[00:00:22] --> Running transaction check
[00:00:22] ---> Package kernel-headers.x86_64 0:3.10.0-957.1.3.el7 will be installed
[00:00:22] ---> Package perl-Pod-Perldoc.noarch 0:3.20-4.el7 will be installed
[00:00:22] --> Processing Dependency: perl(parent) for package: perl-Pod-Perldoc-3.20-4.el7.noarch
[00:00:22] --> Processing Dependency: perl(HTTP::Tiny) for package: perl-Pod-Perldoc-3.20-4.el7.noarch
[00:00:22] --> Processing Dependency: groff-base for package: perl-Pod-Perldoc-3.20-4.el7.noarch
[00:00:22] ---> Package perl-podlators.noarch 0:2.5.1-3.el7 will be installed
[00:00:22] --> Running transaction check
[00:00:22] ---> Package groff-base.x86_64 0:1.22.2-8.el7 will be installed
[00:00:22] ---> Package perl-HTTP-Tiny.noarch 0:0.033-3.el7 will be installed
[00:00:22] ---> Package perl-parent.noarch 1:0.225-244.el7 will be installed
[00:00:22] --> Finished Dependency Resolution
[00:00:22] 
[00:00:22] Dependencies Resolved
[00:00:22] 
[00:00:22] ================================================================================
[00:00:22]  Package                   Arch      Version                   Repository  Size
[00:00:22] ================================================================================
[00:00:22] Installing:
[00:00:22]  createrepo                noarch    0.9.9-28.el7              base        94 k
[00:00:22]  gcc                       x86_64    4.8.5-36.el7              base        16 M
[00:00:22]  make                      x86_64    1:3.82-23.el7             base       420 k
[00:00:22]  perl                      x86_64    4:5.16.3-293.el7          base       8.0 M
[00:00:22]  rpm-build                 x86_64    4.11.3-35.el7             base       147 k
[00:00:22]  rpm-sign                  x86_64    4.11.3-35.el7             base        48 k
[00:00:22]  rsync                     x86_64    3.1.2-4.el7               base       403 k
[00:00:22]  yum-plugin-priorities     noarch    1.1.31-50.el7             base        29 k
[00:00:22]  yum-utils                 noarch    1.1.31-50.el7             base       121 k
[00:00:22] Installing for dependencies:
[00:00:22]  bzip2                     x86_64    1.0.6-13.el7              base        52 k
[00:00:22]  cpp                       x86_64    4.8.5-36.el7              base       5.9 M
[00:00:22]  deltarpm                  x86_64    3.6-3.el7                 base        82 k
[00:00:22]  dwz                       x86_64    0.11-3.el7                base        99 k
[00:00:22]  elfutils                  x86_64    0.172-2.el7               base       299 k
[00:00:22]  file                      x86_64    5.11-35.el7               base        57 k
[00:00:22]  gdb                       x86_64    7.6.1-114.el7             base       2.4 M
[00:00:22]  glibc-devel               x86_64    2.17-260.el7              base       1.1 M
[00:00:22]  glibc-headers             x86_64    2.17-260.el7              base       683 k
[00:00:22]  groff-base                x86_64    1.22.2-8.el7              base       942 k
[00:00:22]  kernel-headers            x86_64    3.10.0-957.1.3.el7        updates    8.0 M
[00:00:22]  libgomp                   x86_64    4.8.5-36.el7              base       157 k
[00:00:22]  libmpc                    x86_64    1.0.1-3.el7               base        51 k
[00:00:22]  libxml2-python            x86_64    2.9.1-6.el7_2.3           base       247 k
[00:00:22]  mpfr                      x86_64    3.1.1-4.el7               base       203 k
[00:00:22]  patch                     x86_64    2.7.1-10.el7_5            base       110 k
[00:00:22]  perl-Carp                 noarch    1.26-244.el7              base        19 k
[00:00:22]  perl-Encode               x86_64    2.51-7.el7                base       1.5 M
[00:00:22]  perl-Exporter             noarch    5.68-3.el7                base        28 k
[00:00:22]  perl-File-Path            noarch    2.09-2.el7                base        26 k
[00:00:22]  perl-File-Temp            noarch    0.23.01-3.el7             base        56 k
[00:00:22]  perl-Filter               x86_64    1.49-3.el7                base        76 k
[00:00:22]  perl-Getopt-Long          noarch    2.40-3.el7                base        56 k
[00:00:22]  perl-HTTP-Tiny            noarch    0.033-3.el7               base        38 k
[00:00:22]  perl-PathTools            x86_64    3.40-5.el7                base        82 k
[00:00:22]  perl-Pod-Escapes          noarch    1:1.04-293.el7            base        51 k
[00:00:22]  perl-Pod-Perldoc          noarch    3.20-4.el7                base        87 k
[00:00:22]  perl-Pod-Simple           noarch    1:3.28-4.el7              base       216 k
[00:00:22]  perl-Pod-Usage            noarch    1.63-3.el7                base        27 k
[00:00:22]  perl-Scalar-List-Utils    x86_64    1.27-248.el7              base        36 k
[00:00:22]  perl-Socket               x86_64    2.010-4.el7               base        49 k
[00:00:22]  perl-Storable             x86_64    2.45-3.el7                base        77 k
[00:00:22]  perl-Text-ParseWords      noarch    3.29-4.el7                base        14 k
[00:00:22]  perl-Thread-Queue         noarch    3.02-2.el7                base        17 k
[00:00:22]  perl-Time-HiRes           x86_64    4:1.9725-3.el7            base        45 k
[00:00:22]  perl-Time-Local           noarch    1.2300-2.el7              base        24 k
[00:00:22]  perl-constant             noarch    1.27-2.el7                base        19 k
[00:00:22]  perl-libs                 x86_64    4:5.16.3-293.el7          base       688 k
[00:00:22]  perl-macros               x86_64    4:5.16.3-293.el7          base        44 k
[00:00:22]  perl-parent               noarch    1:0.225-244.el7           base        12 k
[00:00:22]  perl-podlators            noarch    2.5.1-3.el7               base       112 k
[00:00:22]  perl-srpm-macros          noarch    1-8.el7                   base       4.6 k
[00:00:22]  perl-threads              x86_64    1.87-4.el7                base        49 k
[00:00:22]  perl-threads-shared       x86_64    1.43-6.el7                base        39 k
[00:00:22]  python-chardet            noarch    2.2.1-1.el7_1             base       227 k
[00:00:22]  python-deltarpm           x86_64    3.6-3.el7                 base        31 k
[00:00:22]  python-kitchen            noarch    1.1.1-5.el7               base       267 k
[00:00:22]  redhat-rpm-config         noarch    9.1.0-87.el7.centos       base        81 k
[00:00:22]  unzip                     x86_64    6.0-19.el7                base       170 k
[00:00:22]  zip                       x86_64    3.0-11.el7                base       260 k
[00:00:22] 
[00:00:22] Transaction Summary
[00:00:22] ================================================================================
[00:00:22] Install  9 Packages (+50 Dependent packages)
[00:00:22] 
[00:00:22] Total size: 50 M
[00:00:22] Installed size: 116 M
[00:00:22] Downloading packages:
[00:00:22] Running transaction check
[00:00:22] Running transaction test
[00:00:22] Transaction test succeeded
[00:00:22] Running transaction
[00:00:22]   Installing : mpfr-3.1.1-4.el7.x86_64                                     1/59 
[00:00:22]   Installing : libmpc-1.0.1-3.el7.x86_64                                   2/59 
[00:00:22]   Installing : deltarpm-3.6-3.el7.x86_64                                   3/59 
[00:00:22]   Installing : libxml2-python-2.9.1-6.el7_2.3.x86_64                       4/59 
[00:00:23]   Installing : python-deltarpm-3.6-3.el7.x86_64                            5/59 
[00:00:23]   Installing : cpp-4.8.5-36.el7.x86_64                                     6/59 
[00:00:23]   Installing : elfutils-0.172-2.el7.x86_64                                 7/59 
[00:00:23]   Installing : patch-2.7.1-10.el7_5.x86_64                                 8/59 
[00:00:23]   Installing : unzip-6.0-19.el7.x86_64                                     9/59 
[00:00:23]   Installing : python-chardet-2.2.1-1.el7_1.noarch                        10/59 
[00:00:23]   Installing : python-kitchen-1.1.1-5.el7.noarch                          11/59 
[00:00:24]   Installing : zip-3.0-11.el7.x86_64                                      12/59 
[00:00:24]   Installing : kernel-headers-3.10.0-957.1.3.el7.x86_64                   13/59 
[00:00:24]   Installing : glibc-headers-2.17-260.el7.x86_64                          14/59 
[00:00:24]   Installing : glibc-devel-2.17-260.el7.x86_64                            15/59 
[00:00:24]   Installing : libgomp-4.8.5-36.el7.x86_64                                16/59 
[00:00:24]   Installing : file-5.11-35.el7.x86_64                                    17/59 
[00:00:25]   Installing : perl-srpm-macros-1-8.el7.noarch                            18/59 
[00:00:25]   Installing : gdb-7.6.1-114.el7.x86_64                                   19/59 
[00:00:25]   Installing : dwz-0.11-3.el7.x86_64                                      20/59 
[00:00:25]   Installing : groff-base-1.22.2-8.el7.x86_64                             21/59 
[00:00:25]   Installing : 1:perl-parent-0.225-244.el7.noarch                         22/59 
[00:00:25]   Installing : perl-HTTP-Tiny-0.033-3.el7.noarch                          23/59 
[00:00:25]   Installing : perl-podlators-2.5.1-3.el7.noarch                          24/59 
[00:00:25]   Installing : perl-Pod-Perldoc-3.20-4.el7.noarch                         25/59 
[00:00:25]   Installing : 1:perl-Pod-Escapes-1.04-293.el7.noarch                     26/59 
[00:00:25]   Installing : perl-Text-ParseWords-3.29-4.el7.noarch                     27/59 
[00:00:25]   Installing : perl-Encode-2.51-7.el7.x86_64                              28/59 
[00:00:25]   Installing : perl-Pod-Usage-1.63-3.el7.noarch                           29/59 
[00:00:25]   Installing : perl-threads-1.87-4.el7.x86_64                             30/59 
[00:00:25]   Installing : 4:perl-Time-HiRes-1.9725-3.el7.x86_64                      31/59 
[00:00:25]   Installing : perl-Exporter-5.68-3.el7.noarch                            32/59 
[00:00:25]   Installing : perl-constant-1.27-2.el7.noarch                            33/59 
[00:00:25]   Installing : perl-Carp-1.26-244.el7.noarch                              34/59 
[00:00:25]   Installing : 4:perl-macros-5.16.3-293.el7.x86_64                        35/59 
[00:00:25]   Installing : perl-Time-Local-1.2300-2.el7.noarch                        36/59 
[00:00:25]   Installing : perl-Socket-2.010-4.el7.x86_64                             37/59 
[00:00:25]   Installing : perl-Storable-2.45-3.el7.x86_64                            38/59 
[00:00:25]   Installing : perl-threads-shared-1.43-6.el7.x86_64                      39/59 
[00:00:25]   Installing : perl-PathTools-3.40-5.el7.x86_64                           40/59 
[00:00:26]   Installing : perl-Scalar-List-Utils-1.27-248.el7.x86_64                 41/59 
[00:00:26]   Installing : 1:perl-Pod-Simple-3.28-4.el7.noarch                        42/59 
[00:00:26]   Installing : perl-File-Temp-0.23.01-3.el7.noarch                        43/59 
[00:00:26]   Installing : perl-File-Path-2.09-2.el7.noarch                           44/59 
[00:00:26]   Installing : perl-Filter-1.49-3.el7.x86_64                              45/59 
[00:00:26]   Installing : 4:perl-libs-5.16.3-293.el7.x86_64                          46/59 
[00:00:27]   Installing : perl-Getopt-Long-2.40-3.el7.noarch                         47/59 
[00:00:27]   Installing : 4:perl-5.16.3-293.el7.x86_64                               48/59 
[00:00:27]   Installing : perl-Thread-Queue-3.02-2.el7.noarch                        49/59 
[00:00:27]   Installing : redhat-rpm-config-9.1.0-87.el7.centos.noarch               50/59 
[00:00:27]   Installing : bzip2-1.0.6-13.el7.x86_64                                  51/59 
[00:00:28]   Installing : rpm-build-4.11.3-35.el7.x86_64                             52/59 
[00:00:28]   Installing : gcc-4.8.5-36.el7.x86_64                                    53/59 
[00:00:28]   Installing : yum-utils-1.1.31-50.el7.noarch                             54/59 
[00:00:28]   Installing : createrepo-0.9.9-28.el7.noarch                             55/59 
[00:00:29]   Installing : rsync-3.1.2-4.el7.x86_64                                   56/59 
[00:00:29]   Installing : 1:make-3.82-23.el7.x86_64                                  57/59 
[00:00:29]   Installing : rpm-sign-4.11.3-35.el7.x86_64                              58/59 
[00:00:29]   Installing : yum-plugin-priorities-1.1.31-50.el7.noarch                 59/59 
[00:00:29]   Verifying  : perl-HTTP-Tiny-0.033-3.el7.noarch                           1/59 
[00:00:29]   Verifying  : rpm-build-4.11.3-35.el7.x86_64                              2/59 
[00:00:29]   Verifying  : perl-threads-shared-1.43-6.el7.x86_64                       3/59 
[00:00:29]   Verifying  : 4:perl-Time-HiRes-1.9725-3.el7.x86_64                       4/59 
[00:00:29]   Verifying  : perl-Pod-Perldoc-3.20-4.el7.noarch                          5/59 
[00:00:29]   Verifying  : perl-threads-1.87-4.el7.x86_64                              6/59 
[00:00:29]   Verifying  : perl-Exporter-5.68-3.el7.noarch                             7/59 
[00:00:29]   Verifying  : perl-constant-1.27-2.el7.noarch                             8/59 
[00:00:29]   Verifying  : perl-PathTools-3.40-5.el7.x86_64                            9/59 
[00:00:29]   Verifying  : perl-Carp-1.26-244.el7.noarch                              10/59 
[00:00:29]   Verifying  : 4:perl-macros-5.16.3-293.el7.x86_64                        11/59 
[00:00:29]   Verifying  : 1:perl-parent-0.225-244.el7.noarch                         12/59 
[00:00:29]   Verifying  : bzip2-1.0.6-13.el7.x86_64                                  13/59 
[00:00:29]   Verifying  : gcc-4.8.5-36.el7.x86_64                                    14/59 
[00:00:29]   Verifying  : yum-plugin-priorities-1.1.31-50.el7.noarch                 15/59 
[00:00:29]   Verifying  : groff-base-1.22.2-8.el7.x86_64                             16/59 
[00:00:29]   Verifying  : perl-Thread-Queue-3.02-2.el7.noarch                        17/59 
[00:00:29]   Verifying  : perl-File-Temp-0.23.01-3.el7.noarch                        18/59 
[00:00:29]   Verifying  : 1:perl-Pod-Simple-3.28-4.el7.noarch                        19/59 
[00:00:29]   Verifying  : dwz-0.11-3.el7.x86_64                                      20/59 
[00:00:29]   Verifying  : perl-Time-Local-1.2300-2.el7.noarch                        21/59 
[00:00:29]   Verifying  : gdb-7.6.1-114.el7.x86_64                                   22/59 
[00:00:29]   Verifying  : 1:perl-Pod-Escapes-1.04-293.el7.noarch                     23/59 
[00:00:29]   Verifying  : perl-Text-ParseWords-3.29-4.el7.noarch                     24/59 
[00:00:29]   Verifying  : redhat-rpm-config-9.1.0-87.el7.centos.noarch               25/59 
[00:00:29]   Verifying  : perl-srpm-macros-1-8.el7.noarch                            26/59 
[00:00:29]   Verifying  : perl-Socket-2.010-4.el7.x86_64                             27/59 
[00:00:29]   Verifying  : rpm-sign-4.11.3-35.el7.x86_64                              28/59 
[00:00:29]   Verifying  : file-5.11-35.el7.x86_64                                    29/59 
[00:00:29]   Verifying  : cpp-4.8.5-36.el7.x86_64                                    30/59 
[00:00:29]   Verifying  : libgomp-4.8.5-36.el7.x86_64                                31/59 
[00:00:29]   Verifying  : perl-podlators-2.5.1-3.el7.noarch                          32/59 
[00:00:29]   Verifying  : libxml2-python-2.9.1-6.el7_2.3.x86_64                      33/59 
[00:00:29]   Verifying  : deltarpm-3.6-3.el7.x86_64                                  34/59 
[00:00:29]   Verifying  : perl-Storable-2.45-3.el7.x86_64                            35/59 
[00:00:29]   Verifying  : createrepo-0.9.9-28.el7.noarch                             36/59 
[00:00:29]   Verifying  : perl-Scalar-List-Utils-1.27-248.el7.x86_64                 37/59 
[00:00:29]   Verifying  : 1:make-3.82-23.el7.x86_64                                  38/59 
[00:00:29]   Verifying  : libmpc-1.0.1-3.el7.x86_64                                  39/59 
[00:00:29]   Verifying  : rsync-3.1.2-4.el7.x86_64                                   40/59 
[00:00:29]   Verifying  : kernel-headers-3.10.0-957.1.3.el7.x86_64                   41/59 
[00:00:29]   Verifying  : perl-Pod-Usage-1.63-3.el7.noarch                           42/59 
[00:00:29]   Verifying  : perl-Encode-2.51-7.el7.x86_64                              43/59 
[00:00:29]   Verifying  : glibc-devel-2.17-260.el7.x86_64                            44/59 
[00:00:29]   Verifying  : yum-utils-1.1.31-50.el7.noarch                             45/59 
[00:00:29]   Verifying  : python-deltarpm-3.6-3.el7.x86_64                           46/59 
[00:00:29]   Verifying  : 4:perl-5.16.3-293.el7.x86_64                               47/59 
[00:00:29]   Verifying  : perl-File-Path-2.09-2.el7.noarch                           48/59 
[00:00:29]   Verifying  : zip-3.0-11.el7.x86_64                                      49/59 
[00:00:29]   Verifying  : mpfr-3.1.1-4.el7.x86_64                                    50/59 
[00:00:29]   Verifying  : glibc-headers-2.17-260.el7.x86_64                          51/59 
[00:00:29]   Verifying  : python-chardet-2.2.1-1.el7_1.noarch                        52/59 
[00:00:29]   Verifying  : perl-Filter-1.49-3.el7.x86_64                              53/59 
[00:00:29]   Verifying  : perl-Getopt-Long-2.40-3.el7.noarch                         54/59 
[00:00:29]   Verifying  : python-kitchen-1.1.1-5.el7.noarch                          55/59 
[00:00:29]   Verifying  : unzip-6.0-19.el7.x86_64                                    56/59 
[00:00:29]   Verifying  : patch-2.7.1-10.el7_5.x86_64                                57/59 
[00:00:29]   Verifying  : 4:perl-libs-5.16.3-293.el7.x86_64                          58/59 
[00:00:29]   Verifying  : elfutils-0.172-2.el7.x86_64                                59/59 
[00:00:29] 
[00:00:29] Installed:
[00:00:29]   createrepo.noarch 0:0.9.9-28.el7 gcc.x86_64 0:4.8.5-36.el7                   
[00:00:29]   make.x86_64 1:3.82-23.el7        perl.x86_64 4:5.16.3-293.el7                
[00:00:29]   rpm-build.x86_64 0:4.11.3-35.el7 rpm-sign.x86_64 0:4.11.3-35.el7             
[00:00:29]   rsync.x86_64 0:3.1.2-4.el7       yum-plugin-priorities.noarch 0:1.1.31-50.el7
[00:00:29]   yum-utils.noarch 0:1.1.31-50.el7
[00:00:29] 
[00:00:29] Dependency Installed:
[00:00:29]   bzip2.x86_64 0:1.0.6-13.el7                                                   
[00:00:29]   cpp.x86_64 0:4.8.5-36.el7                                                     
[00:00:29]   deltarpm.x86_64 0:3.6-3.el7                                                   
[00:00:29]   dwz.x86_64 0:0.11-3.el7                                                       
[00:00:29]   elfutils.x86_64 0:0.172-2.el7                                                 
[00:00:29]   file.x86_64 0:5.11-35.el7                                                     
[00:00:29]   gdb.x86_64 0:7.6.1-114.el7                                                    
[00:00:29]   glibc-devel.x86_64 0:2.17-260.el7                                             
[00:00:29]   glibc-headers.x86_64 0:2.17-260.el7                                           
[00:00:29]   groff-base.x86_64 0:1.22.2-8.el7                                              
[00:00:29]   kernel-headers.x86_64 0:3.10.0-957.1.3.el7                                    
[00:00:29]   libgomp.x86_64 0:4.8.5-36.el7                                                 
[00:00:29]   libmpc.x86_64 0:1.0.1-3.el7                                                   
[00:00:29]   libxml2-python.x86_64 0:2.9.1-6.el7_2.3                                       
[00:00:29]   mpfr.x86_64 0:3.1.1-4.el7                                                     
[00:00:29]   patch.x86_64 0:2.7.1-10.el7_5                                                 
[00:00:29]   perl-Carp.noarch 0:1.26-244.el7                                               
[00:00:29]   perl-Encode.x86_64 0:2.51-7.el7                                               
[00:00:29]   perl-Exporter.noarch 0:5.68-3.el7                                             
[00:00:29]   perl-File-Path.noarch 0:2.09-2.el7                                            
[00:00:29]   perl-File-Temp.noarch 0:0.23.01-3.el7                                         
[00:00:29]   perl-Filter.x86_64 0:1.49-3.el7                                               
[00:00:29]   perl-Getopt-Long.noarch 0:2.40-3.el7                                          
[00:00:29]   perl-HTTP-Tiny.noarch 0:0.033-3.el7                                           
[00:00:29]   perl-PathTools.x86_64 0:3.40-5.el7                                            
[00:00:29]   perl-Pod-Escapes.noarch 1:1.04-293.el7                                        
[00:00:29]   perl-Pod-Perldoc.noarch 0:3.20-4.el7                                          
[00:00:29]   perl-Pod-Simple.noarch 1:3.28-4.el7                                           
[00:00:29]   perl-Pod-Usage.noarch 0:1.63-3.el7                                            
[00:00:29]   perl-Scalar-List-Utils.x86_64 0:1.27-248.el7                                  
[00:00:29]   perl-Socket.x86_64 0:2.010-4.el7                                              
[00:00:29]   perl-Storable.x86_64 0:2.45-3.el7                                             
[00:00:29]   perl-Text-ParseWords.noarch 0:3.29-4.el7                                      
[00:00:29]   perl-Thread-Queue.noarch 0:3.02-2.el7                                         
[00:00:29]   perl-Time-HiRes.x86_64 4:1.9725-3.el7                                         
[00:00:29]   perl-Time-Local.noarch 0:1.2300-2.el7                                         
[00:00:29]   perl-constant.noarch 0:1.27-2.el7                                             
[00:00:29]   perl-libs.x86_64 4:5.16.3-293.el7                                             
[00:00:29]   perl-macros.x86_64 4:5.16.3-293.el7                                           
[00:00:29]   perl-parent.noarch 1:0.225-244.el7                                            
[00:00:29]   perl-podlators.noarch 0:2.5.1-3.el7                                           
[00:00:29]   perl-srpm-macros.noarch 0:1-8.el7                                             
[00:00:29]   perl-threads.x86_64 0:1.87-4.el7                                              
[00:00:29]   perl-threads-shared.x86_64 0:1.43-6.el7                                       
[00:00:29]   python-chardet.noarch 0:2.2.1-1.el7_1                                         
[00:00:29]   python-deltarpm.x86_64 0:3.6-3.el7                                            
[00:00:29]   python-kitchen.noarch 0:1.1.1-5.el7                                           
[00:00:29]   redhat-rpm-config.noarch 0:9.1.0-87.el7.centos                                
[00:00:29]   unzip.x86_64 0:6.0-19.el7                                                     
[00:00:29]   zip.x86_64 0:3.0-11.el7                                                       
[00:00:29] 
[00:00:29] Complete!
[00:00:29] 0
[00:00:29] now running: ssh -f -o "StrictHostKeyChecking no" -o Port=22 -i /etc/lightbuildserver/container/container_rsa root@10.0.3.5 "export LC_ALL=C; (if [ -f /etc/yum.repos.d/CentOS-Sources.repo ]; then rm -Rf /etc/yum.repos.d/CentOS-Sources.repo; fi) 2>&1 && echo \$?"
[00:00:29] 0
[00:00:29] now running: ssh -f -o "StrictHostKeyChecking no" -o Port=22 -i /etc/lightbuildserver/container/container_rsa root@10.0.3.5 "export LC_ALL=C; (if [ -f /etc/yum.repos.d/CentOS-Vault.repo ]; then rm -Rf /etc/yum.repos.d/CentOS-Vault.repo; fi) 2>&1 && echo \$?"
[00:00:30] 0
[00:00:30] now running: ssh -f -o "StrictHostKeyChecking no" -o Port=22 -i /etc/lightbuildserver/container/container_rsa root@10.0.3.5 "export LC_ALL=C; (mkdir -p rpmbuild/{BUILD,RPMS,SOURCES,SPECS,SRPMS}) 2>&1 && echo \$?"
[00:00:30] 0
[00:00:30] now running: rsync -avz --delete -e "ssh -i /etc/lightbuildserver/container/container_rsa -p 2222" /var/lib/lightbuildserver/src/tbits.net/lbs-TBitsKolab16Test root@build04lxc.lbs.solidcharity.com:/var/lib/lxc/005-build04lxc.lbs.solidcharity.com/rootfs/root
[00:00:30] sending incremental file list
[00:00:30] lbs-TBitsKolab16Test/
[00:00:30] lbs-TBitsKolab16Test/Readme.md
[00:00:30] lbs-TBitsKolab16Test/config.yml
[00:00:30] lbs-TBitsKolab16Test/chwala/
[00:00:30] lbs-TBitsKolab16Test/chwala/chwala-0.2-suhosin.session.encrypt-php_flag.patch
[00:00:30] lbs-TBitsKolab16Test/chwala/chwala-0.5.2.tar.gz
[00:00:30] lbs-TBitsKolab16Test/chwala/chwala.logrotate
[00:00:30] lbs-TBitsKolab16Test/chwala/chwala.spec
[00:00:30] lbs-TBitsKolab16Test/chwala/fix-autoload-path-debian.patch
[00:00:30] lbs-TBitsKolab16Test/cyrus-imapd/
[00:00:30] lbs-TBitsKolab16Test/cyrus-imapd/0001-dlist-Use-int8_t-in-dlist_parsemap.patch
[00:00:30] lbs-TBitsKolab16Test/cyrus-imapd/0002-Avoid-returning-1-as-255.patch
[00:00:30] lbs-TBitsKolab16Test/cyrus-imapd/cyr_systemd_helper
[00:00:30] lbs-TBitsKolab16Test/cyrus-imapd/cyrus-imapd-2.5.11-41-gd53406f3f.tar.gz
[00:00:30] lbs-TBitsKolab16Test/cyrus-imapd/cyrus-imapd.cron-daily
[00:00:30] lbs-TBitsKolab16Test/cyrus-imapd/cyrus-imapd.cvt_cyrusdb_all
[00:00:30] lbs-TBitsKolab16Test/cyrus-imapd/cyrus-imapd.imap-2.3.x-conf
[00:00:30] lbs-TBitsKolab16Test/cyrus-imapd/cyrus-imapd.init
[00:00:30] lbs-TBitsKolab16Test/cyrus-imapd/cyrus-imapd.logrotate
[00:00:30] lbs-TBitsKolab16Test/cyrus-imapd/cyrus-imapd.magic
[00:00:30] lbs-TBitsKolab16Test/cyrus-imapd/cyrus-imapd.pam-config
[00:00:30] lbs-TBitsKolab16Test/cyrus-imapd/cyrus-imapd.service
[00:00:30] lbs-TBitsKolab16Test/cyrus-imapd/cyrus-imapd.spec
[00:00:30] lbs-TBitsKolab16Test/cyrus-imapd/cyrus-imapd.sysconfig
[00:00:30] lbs-TBitsKolab16Test/cyrus-imapd/cyrus-imapd.upstream
[00:00:30] lbs-TBitsKolab16Test/cyrus-imapd/cyrus_canonification_multiple_domains.patch
[00:00:30] lbs-TBitsKolab16Test/cyrus-imapd/cyrus_filter_kolab_mailboxes.patch
[00:00:30] lbs-TBitsKolab16Test/iRony/
[00:00:30] lbs-TBitsKolab16Test/iRony/add-sabre21-path-for-debian.patch
[00:00:30] lbs-TBitsKolab16Test/iRony/iRony-0.4.1.tar.gz
[00:00:31] lbs-TBitsKolab16Test/iRony/iRony.conf
[00:00:31] lbs-TBitsKolab16Test/iRony/iRony.logrotate
[00:00:31] lbs-TBitsKolab16Test/iRony/iRony.spec
[00:00:31] lbs-TBitsKolab16Test/kolab-autoconf/
[00:00:31] lbs-TBitsKolab16Test/kolab-autoconf/kolab-autoconf-1.3.tar.gz
[00:00:31] lbs-TBitsKolab16Test/kolab-autoconf/kolab-autoconf.spec
[00:00:31] lbs-TBitsKolab16Test/kolab-autoconf/kolab-autoconf.upstream
[00:00:31] lbs-TBitsKolab16Test/kolab-freebusy/
[00:00:31] lbs-TBitsKolab16Test/kolab-freebusy/kolab-freebusy-1.1.0.tar.gz
[00:00:31] lbs-TBitsKolab16Test/kolab-freebusy/kolab-freebusy.conf
[00:00:31] lbs-TBitsKolab16Test/kolab-freebusy/kolab-freebusy.logrotate
[00:00:31] lbs-TBitsKolab16Test/kolab-freebusy/kolab-freebusy.spec
[00:00:31] lbs-TBitsKolab16Test/kolab-freebusy/kolab-freebusy.upstream
[00:00:31] lbs-TBitsKolab16Test/kolab-schema/
[00:00:31] lbs-TBitsKolab16Test/kolab-schema/kolab-schema-3.3.tar.gz
[00:00:31] lbs-TBitsKolab16Test/kolab-schema/kolab-schema.spec
[00:00:31] lbs-TBitsKolab16Test/kolab-syncroton/
[00:00:31] lbs-TBitsKolab16Test/kolab-syncroton/kolab-syncroton-2.3.12.tar.gz
[00:00:31] lbs-TBitsKolab16Test/kolab-syncroton/kolab-syncroton.logrotate
[00:00:31] lbs-TBitsKolab16Test/kolab-syncroton/kolab-syncroton.spec
[00:00:31] lbs-TBitsKolab16Test/kolab-utils/
[00:00:31] lbs-TBitsKolab16Test/kolab-utils/0002-no-tests-for-fbdaemon.patch
[00:00:31] lbs-TBitsKolab16Test/kolab-utils/kolab-utils-3.1.4.tar.gz
[00:00:31] lbs-TBitsKolab16Test/kolab-utils/kolab-utils.spec
[00:00:31] lbs-TBitsKolab16Test/kolab-webadmin/
[00:00:31] lbs-TBitsKolab16Test/kolab-webadmin/99tbits.ldif
[00:00:31] lbs-TBitsKolab16Test/kolab-webadmin/canonification_via_uid_wap.patch
[00:00:31] lbs-TBitsKolab16Test/kolab-webadmin/domainAdminDefaultQuota.patch
[00:00:31] lbs-TBitsKolab16Test/kolab-webadmin/domainAdminMaxAccounts.patch
[00:00:31] lbs-TBitsKolab16Test/kolab-webadmin/domainquotaBug2046.patch
[00:00:31] lbs-TBitsKolab16Test/kolab-webadmin/dont_generate_attribs_when_editing.patch
[00:00:31] lbs-TBitsKolab16Test/kolab-webadmin/initTBitsUserTypes.php
[00:00:31] lbs-TBitsKolab16Test/kolab-webadmin/intranetToken-wap.patch
[00:00:31] lbs-TBitsKolab16Test/kolab-webadmin/kolab-webadmin-3.2.12.tar.gz
[00:00:31] lbs-TBitsKolab16Test/kolab-webadmin/kolab-webadmin.spec
[00:00:31] lbs-TBitsKolab16Test/kolab-webadmin/kolab-webadmin.upstream
[00:00:31] lbs-TBitsKolab16Test/kolab-webadmin/lastLoginTBitsAttribute-wap.patch
[00:00:31] lbs-TBitsKolab16Test/kolab-webadmin/listUsersLastLoginQuotaUsage.patch
[00:00:31] lbs-TBitsKolab16Test/kolab-webadmin/patchMultiDomainAdminsBug2018.patch
[00:00:31] lbs-TBitsKolab16Test/kolab-webadmin/quotaused_wap.patch
[00:00:31] lbs-TBitsKolab16Test/kolab-webadmin/validateAliasDomainPostfixVirtualFileBug2658.patch
[00:00:31] lbs-TBitsKolab16Test/kolab-webadmin/wap_api_listuserswithhash.patch
[00:00:31] lbs-TBitsKolab16Test/kolab-webadmin/wap_disallow_users.patch
[00:00:31] lbs-TBitsKolab16Test/kolab/
[00:00:31] lbs-TBitsKolab16Test/kolab/README
[00:00:31] lbs-TBitsKolab16Test/kolab/kolab-16.0.1.tar.gz
[00:00:31] lbs-TBitsKolab16Test/kolab/kolab.spec
[00:00:31] lbs-TBitsKolab16Test/kolab/kolab.upstream
[00:00:31] lbs-TBitsKolab16Test/libcalendaring/
[00:00:31] lbs-TBitsKolab16Test/libcalendaring/0001-Correct-shebangs.patch
[00:00:31] lbs-TBitsKolab16Test/libcalendaring/ical3-support.patch
[00:00:31] lbs-TBitsKolab16Test/libcalendaring/libcalendaring-4.9.2.tar.gz
[00:00:31] lbs-TBitsKolab16Test/libcalendaring/libcalendaring.spec
[00:00:31] lbs-TBitsKolab16Test/libkolab/
[00:00:31] lbs-TBitsKolab16Test/libkolab/libkolab-0.4.2-cmake-2.8.11.patch
[00:00:31] lbs-TBitsKolab16Test/libkolab/libkolab-0.5-swigutils.cmake.patch
[00:00:31] lbs-TBitsKolab16Test/libkolab/libkolab-2.0.tar.gz
[00:00:31] lbs-TBitsKolab16Test/libkolab/libkolab.spec
[00:00:31] lbs-TBitsKolab16Test/libkolabxml/
[00:00:31] lbs-TBitsKolab16Test/libkolabxml/fix-qverify-argument.patch
[00:00:31] lbs-TBitsKolab16Test/libkolabxml/libkolabxml-1.2.tar.gz
[00:00:31] lbs-TBitsKolab16Test/libkolabxml/libkolabxml.spec
[00:00:31] lbs-TBitsKolab16Test/libkolabxml/libossp-uuid-include.patch
[00:00:31] lbs-TBitsKolab16Test/mozldap/
[00:00:31] lbs-TBitsKolab16Test/mozldap/debian-aggregate.patch
[00:00:31] lbs-TBitsKolab16Test/mozldap/mozldap-6.0.7.tar.gz
[00:00:31] lbs-TBitsKolab16Test/mozldap/mozldap.spec
[00:00:31] lbs-TBitsKolab16Test/php-christianriesen-base32/
[00:00:31] lbs-TBitsKolab16Test/php-christianriesen-base32/christianriesen-base32-1.2.1.tar.gz
[00:00:31] lbs-TBitsKolab16Test/php-christianriesen-base32/php-christianriesen-base32.spec
[00:00:31] lbs-TBitsKolab16Test/php-endroid-qrcode/
[00:00:31] lbs-TBitsKolab16Test/php-endroid-qrcode/endroid-qrcode-1.5.4.tar.gz
[00:00:31] lbs-TBitsKolab16Test/php-endroid-qrcode/php-endroid-qrcode.spec
[00:00:31] lbs-TBitsKolab16Test/php-enygma-yubikey/
[00:00:31] lbs-TBitsKolab16Test/php-enygma-yubikey/enygma-yubikey-3.2.tar.gz
[00:00:31] lbs-TBitsKolab16Test/php-enygma-yubikey/php-enygma-yubikey.spec
[00:00:31] lbs-TBitsKolab16Test/php-sabre-dav/
[00:00:31] lbs-TBitsKolab16Test/php-sabre-dav/0001-Use-homemade-autoload.php.patch
[00:00:31] lbs-TBitsKolab16Test/php-sabre-dav/0002-Drop-Composer-autoLoader-calls.patch
[00:00:31] lbs-TBitsKolab16Test/php-sabre-dav/0003-Increase-timeout.patch
[00:00:31] lbs-TBitsKolab16Test/php-sabre-dav/0004-Install-sabredav.php-in-usr-share-php-sabre21-Sabre.patch
[00:00:31] lbs-TBitsKolab16Test/php-sabre-dav/0005-tfix-threshold.patch
[00:00:31] lbs-TBitsKolab16Test/php-sabre-dav/0006-tfix-selection.patch
[00:00:31] lbs-TBitsKolab16Test/php-sabre-dav/0007-Rename-naturalselection-as-naturalselection21.patch
[00:00:31] lbs-TBitsKolab16Test/php-sabre-dav/0008-Fix-upper-limit-after-spurious-upload-of-php-sabre-e.patch
[00:00:31] lbs-TBitsKolab16Test/php-sabre-dav/0009-naturalselection.1-wfix.patch
[00:00:31] lbs-TBitsKolab16Test/php-sabre-dav/autoload.php
[00:00:31] lbs-TBitsKolab16Test/php-sabre-dav/php-sabre-dav.spec
[00:00:31] lbs-TBitsKolab16Test/php-sabre-dav/sabre-dav-2.1.11.tar.gz
[00:00:31] lbs-TBitsKolab16Test/php-sabre-event/
[00:00:31] lbs-TBitsKolab16Test/php-sabre-event/php-sabre-event.spec
[00:00:31] lbs-TBitsKolab16Test/php-sabre-event/sabre-event-2.0.2.tar.gz
[00:00:31] lbs-TBitsKolab16Test/php-sabre-http/
[00:00:31] lbs-TBitsKolab16Test/php-sabre-http/0001-Use-homemade-autoload.php.patch
[00:00:31] lbs-TBitsKolab16Test/php-sabre-http/0002-Fix-upper-limit-after-spurious-upload-of-php-sabre-e.patch
[00:00:31] lbs-TBitsKolab16Test/php-sabre-http/php-sabre-http.spec
[00:00:31] lbs-TBitsKolab16Test/php-sabre-http/sabre-http-3.0.5.tar.gz
[00:00:31] lbs-TBitsKolab16Test/php-sabre-vobject/
[00:00:31] lbs-TBitsKolab16Test/php-sabre-vobject/0001-Use-homemade-autoloader.php.patch
[00:00:31] lbs-TBitsKolab16Test/php-sabre-vobject/0002-replace-with-homemade-tests-autoloader.patch
[00:00:31] lbs-TBitsKolab16Test/php-sabre-vobject/Canada-East-Saskatchewan-removed-in-2017.3.patch
[00:00:31] lbs-TBitsKolab16Test/php-sabre-vobject/T41247.patch
[00:00:31] lbs-TBitsKolab16Test/php-sabre-vobject/php-sabre-vobject.spec
[00:00:31] lbs-TBitsKolab16Test/php-sabre-vobject/sabre-vobject-3.5.3.tar.gz
[00:00:31] lbs-TBitsKolab16Test/php-sabre-vobject/sabre-vobject-bin.patch
[00:00:31] lbs-TBitsKolab16Test/php-spomky-labs-otphp/
[00:00:31] lbs-TBitsKolab16Test/php-spomky-labs-otphp/php-spomky-labs-otphp.spec
[00:00:31] lbs-TBitsKolab16Test/php-spomky-labs-otphp/spomky-labs-otphp-4.0.2.tar.gz
[00:00:31] lbs-TBitsKolab16Test/pykolab/
[00:00:31] lbs-TBitsKolab16Test/pykolab/allowPrimaryEmailAddressFromDomain.patch
[00:00:31] lbs-TBitsKolab16Test/pykolab/canonification_via_uid_pykolab.patch
[00:00:31] lbs-TBitsKolab16Test/pykolab/cyrus-imapd.conf-cert-paths.patch
[00:00:31] lbs-TBitsKolab16Test/pykolab/disableSpamFilter.patch
[00:00:31] lbs-TBitsKolab16Test/pykolab/disableSpamFilter2.patch
[00:00:31] lbs-TBitsKolab16Test/pykolab/fixPykolabIMAPKeepAlive.patch
[00:00:31] lbs-TBitsKolab16Test/pykolab/kolab_lam_invalid_mailbox_name.patch
[00:00:31] lbs-TBitsKolab16Test/pykolab/lastLoginTBitsAttribute-pykolab.patch
[00:00:31] lbs-TBitsKolab16Test/pykolab/logLoginData.patch
[00:00:31] lbs-TBitsKolab16Test/pykolab/onlyAllowKolabUsersToAuthViaSasl.patch
[00:00:31] lbs-TBitsKolab16Test/pykolab/pykolab-0.8-patch-out-manticore.patch
[00:00:31] lbs-TBitsKolab16Test/pykolab/pykolab-0.8.9.tar.gz
[00:00:31] lbs-TBitsKolab16Test/pykolab/pykolab.logrotate
[00:00:31] lbs-TBitsKolab16Test/pykolab/pykolab.spec
[00:00:31] lbs-TBitsKolab16Test/pykolab/pykolab.upstream
[00:00:31] lbs-TBitsKolab16Test/pykolab/pykolab_do_not_rename_existing_mailbox_T3315.patch
[00:00:31] lbs-TBitsKolab16Test/pykolab/pykolab_no_guam.patch
[00:00:31] lbs-TBitsKolab16Test/pykolab/pykolab_wap_client_unverified_context_localhost.patch
[00:00:31] lbs-TBitsKolab16Test/python-icalendar/
[00:00:31] lbs-TBitsKolab16Test/python-icalendar/icalendar-3.8.2.tar.gz
[00:00:31] lbs-TBitsKolab16Test/python-icalendar/python-icalendar.spec
[00:00:31] lbs-TBitsKolab16Test/python-sievelib/
[00:00:31] lbs-TBitsKolab16Test/python-sievelib/python-sievelib.spec
[00:00:31] lbs-TBitsKolab16Test/python-sievelib/sievelib-0.5.2.tar.gz
[00:00:31] lbs-TBitsKolab16Test/roundcubemail-plugin-contextmenu/
[00:00:31] lbs-TBitsKolab16Test/roundcubemail-plugin-contextmenu/README
[00:00:31] lbs-TBitsKolab16Test/roundcubemail-plugin-contextmenu/roundcubemail-plugin-contextmenu-2.3.tar.gz
[00:00:31] lbs-TBitsKolab16Test/roundcubemail-plugin-contextmenu/roundcubemail-plugin-contextmenu.spec
[00:00:31] lbs-TBitsKolab16Test/roundcubemail-plugin-ude_login/
[00:00:31] lbs-TBitsKolab16Test/roundcubemail-plugin-ude_login/comm.py
[00:00:31] lbs-TBitsKolab16Test/roundcubemail-plugin-ude_login/roundcubemail-plugin-ude_login-4.0.0.tar.gz
[00:00:31] lbs-TBitsKolab16Test/roundcubemail-plugin-ude_login/roundcubemail-plugin-ude_login.spec
[00:00:31] lbs-TBitsKolab16Test/roundcubemail-plugins-kolab/
[00:00:31] lbs-TBitsKolab16Test/roundcubemail-plugins-kolab/0001-Fix-missing-first-occurrence-of-an-event-when-moved-.patch
[00:00:31] lbs-TBitsKolab16Test/roundcubemail-plugins-kolab/canonification_via_uid_roundcube.patch
[00:00:31] lbs-TBitsKolab16Test/roundcubemail-plugins-kolab/comm.py
[00:00:31] lbs-TBitsKolab16Test/roundcubemail-plugins-kolab/plesk.calendar.inc.php
[00:00:31] lbs-TBitsKolab16Test/roundcubemail-plugins-kolab/plesk.kolab_addressbook.inc.php
[00:00:31] lbs-TBitsKolab16Test/roundcubemail-plugins-kolab/plesk.kolab_folders.inc.php
[00:00:31] lbs-TBitsKolab16Test/roundcubemail-plugins-kolab/plesk.libkolab.inc.php
[00:00:31] lbs-TBitsKolab16Test/roundcubemail-plugins-kolab/roundcubeStorageMariadbBug4883.patch
[00:00:31] lbs-TBitsKolab16Test/roundcubemail-plugins-kolab/roundcube_calendar_etc_timezone_T2666.patch
[00:00:31] lbs-TBitsKolab16Test/roundcubemail-plugins-kolab/roundcubemail-plugins-kolab-3.3-kolab-files-manticore-api.patch
[00:00:31] lbs-TBitsKolab16Test/roundcubemail-plugins-kolab/roundcubemail-plugins-kolab-3.3.6.tar.gz
[00:00:31] lbs-TBitsKolab16Test/roundcubemail-plugins-kolab/roundcubemail-plugins-kolab.spec
[00:00:31] lbs-TBitsKolab16Test/roundcubemail-plugins-kolab/roundcubemail-plugins-kolab.upstream
[00:00:31] lbs-TBitsKolab16Test/roundcubemail-skin-chameleon/
[00:00:31] lbs-TBitsKolab16Test/roundcubemail-skin-chameleon/roundcubemail-skin-chameleon-0.3.9.tar.gz
[00:00:31] lbs-TBitsKolab16Test/roundcubemail-skin-chameleon/roundcubemail-skin-chameleon.spec
[00:00:31] lbs-TBitsKolab16Test/roundcubemail/
[00:00:31] lbs-TBitsKolab16Test/roundcubemail/0002-Parse-all-quotas-from-GETQUOTAROOT-6280.patch
[00:00:31] lbs-TBitsKolab16Test/roundcubemail/0003-Update-changelog.patch
[00:00:31] lbs-TBitsKolab16Test/roundcubemail/0004-Fix-bug-where-some-escape-sequences-in-html-styles-c.patch
[00:00:31] lbs-TBitsKolab16Test/roundcubemail/0005-Fix-bug-where-some-forbidden-characters-on-Cyrus-IMA.patch
[00:00:31] lbs-TBitsKolab16Test/roundcubemail/2017111400.sql
[00:00:31] lbs-TBitsKolab16Test/roundcubemail/backport_managesieve_forwards.patch
[00:00:31] lbs-TBitsKolab16Test/roundcubemail/comm.py
[00:00:31] lbs-TBitsKolab16Test/roundcubemail/default-configuration.patch
[00:00:31] lbs-TBitsKolab16Test/roundcubemail/optional_disable_addressbook_export.patch
[00:00:31] lbs-TBitsKolab16Test/roundcubemail/plesk.config.inc.php
[00:00:31] lbs-TBitsKolab16Test/roundcubemail/plesk.managesieve.inc.php
[00:00:31] lbs-TBitsKolab16Test/roundcubemail/plesk.password.inc.php
[00:00:31] lbs-TBitsKolab16Test/roundcubemail/roundcubemail-1.3.6-plugin-enigma-homedir.patch
[00:00:31] lbs-TBitsKolab16Test/roundcubemail/roundcubemail-1.3.6.tar.gz
[00:00:32] lbs-TBitsKolab16Test/roundcubemail/roundcubemail-1.3.8.tar.gz
[00:00:32] lbs-TBitsKolab16Test/roundcubemail/roundcubemail.conf
[00:00:32] lbs-TBitsKolab16Test/roundcubemail/roundcubemail.logrotate
[00:00:32] lbs-TBitsKolab16Test/roundcubemail/roundcubemail.spec
[00:00:32] lbs-TBitsKolab16Test/roundcubemail/roundcubemail.upstream
[00:00:32] lbs-TBitsKolab16Test/roundcubemail/roundcubemail_messages.patch
[00:00:32] lbs-TBitsKolab16Test/updatePackages/
[00:00:32] lbs-TBitsKolab16Test/updatePackages/backport_managesieve_forwards.patch
[00:00:32] lbs-TBitsKolab16Test/updatePackages/comm.py
[00:00:32] lbs-TBitsKolab16Test/updatePackages/cyrus-imapd.patch
[00:00:32] lbs-TBitsKolab16Test/updatePackages/kolab-autoconf.patch
[00:00:32] lbs-TBitsKolab16Test/updatePackages/kolab-freebusy.patch
[00:00:32] lbs-TBitsKolab16Test/updatePackages/kolab-webadmin.patch
[00:00:32] lbs-TBitsKolab16Test/updatePackages/kolab.patch
[00:00:32] lbs-TBitsKolab16Test/updatePackages/pykolab.patch
[00:00:32] lbs-TBitsKolab16Test/updatePackages/pykolab_no_guam.patch
[00:00:32] lbs-TBitsKolab16Test/updatePackages/roundcubemail-1.3.8.tar.gz
[00:00:32] lbs-TBitsKolab16Test/updatePackages/roundcubemail-plugins-kolab.patch
[00:00:32] lbs-TBitsKolab16Test/updatePackages/roundcubemail.patch
[00:00:32] lbs-TBitsKolab16Test/updatePackages/roundcubemail_messages.patch
[00:00:32] lbs-TBitsKolab16Test/updatePackages/setup.sh
[00:00:32] 
[00:00:32] sent 56,489,780 bytes  received 3,916 bytes  16,141,056.00 bytes/sec
[00:00:32] total size is 57,609,851  speedup is 1.02
[00:00:32] now running: ssh -f -o "StrictHostKeyChecking no" -o Port=22 -i /etc/lightbuildserver/container/container_rsa root@10.0.3.5 "export LC_ALL=C; (if [ ! -f /etc/yum.repos.d/epel-release.repo ]; then exit -1; fi) 2>&1 && echo \$?"
[00:00:32] now running: ssh -f -o "StrictHostKeyChecking no" -o Port=22 -i /etc/lightbuildserver/container/container_rsa root@10.0.3.5 "export LC_ALL=C; (yum -y install epel-release) 2>&1 && echo \$?"
[00:00:33] Loaded plugins: fastestmirror, priorities
[00:00:33] Loading mirror speeds from cached hostfile
[00:00:33]  * base: centos.copahost.com
[00:00:33]  * extras: centos.mirror.net-d-sign.de
[00:00:33]  * updates: ftp.plusline.net
[00:00:33] Resolving Dependencies
[00:00:33] --> Running transaction check
[00:00:33] ---> Package epel-release.noarch 0:7-11 will be installed
[00:00:33] --> Finished Dependency Resolution
[00:00:33] 
[00:00:33] Dependencies Resolved
[00:00:33] 
[00:00:33] ================================================================================
[00:00:33]  Package                Arch             Version         Repository        Size
[00:00:33] ================================================================================
[00:00:33] Installing:
[00:00:33]  epel-release           noarch           7-11            extras            15 k
[00:00:33] 
[00:00:33] Transaction Summary
[00:00:33] ================================================================================
[00:00:33] Install  1 Package
[00:00:33] 
[00:00:33] Total size: 15 k
[00:00:33] Installed size: 24 k
[00:00:33] Downloading packages:
[00:00:33] Running transaction check
[00:00:33] Running transaction test
[00:00:33] Transaction test succeeded
[00:00:33] Running transaction
[00:00:33]   Installing : epel-release-7-11.noarch                                     1/1 
[00:00:33]   Verifying  : epel-release-7-11.noarch                                     1/1 
[00:00:33] 
[00:00:33] Installed:
[00:00:33]   epel-release.noarch 0:7-11                                                    
[00:00:33] 
[00:00:33] Complete!
[00:00:33] 0
[00:00:33] now running: rsync -avz --delete -e "ssh -i /etc/lightbuildserver/container/container_rsa -p 2222" /var/lib/lightbuildserver/repos/tbits.net/TBitsKolab16Test/centos/7/lbs-tbits.net-TBitsKolab16Test.repo root@build04lxc.lbs.solidcharity.com:/var/lib/lxc/005-build04lxc.lbs.solidcharity.com/rootfs/etc/yum.repos.d
[00:00:33] sending incremental file list
[00:00:33] lbs-tbits.net-TBitsKolab16Test.repo
[00:00:33] 
[00:00:33] sent 252 bytes  received 35 bytes  574.00 bytes/sec
[00:00:33] total size is 169  speedup is 0.59
[00:00:33] now running: ssh -f -o "StrictHostKeyChecking no" -o Port=22 -i /etc/lightbuildserver/container/container_rsa root@10.0.3.5 "export LC_ALL=C; (echo "priority = 60" >> /etc/yum.repos.d/lbs-tbits.net-TBitsKolab16Test.repo) 2>&1 && echo \$?"
[00:00:34] 0
[00:00:34] now running: ssh -f -o "StrictHostKeyChecking no" -o Port=22 -i /etc/lightbuildserver/container/container_rsa root@10.0.3.5 "export LC_ALL=C; (yum clean metadata) 2>&1 && echo \$?"
[00:00:34] Loaded plugins: fastestmirror, priorities
[00:00:34] Cleaning repos: base epel extras lbs-tbits.net-TBitsKolab16Test updates
[00:00:34] 19 metadata files removed
[00:00:34] 9 sqlite files removed
[00:00:34] 0 metadata files removed
[00:00:34] 0
[00:00:34] now running: ssh -f -o "StrictHostKeyChecking no" -o Port=22 -i /etc/lightbuildserver/container/container_rsa root@10.0.3.5 "export LC_ALL=C; (sed -e 's/Release:.*%{release}/Release: 0/g' lbs-TBitsKolab16Test/roundcubemail-plugin-ude_login/roundcubemail-plugin-ude_login.spec > /tmp/roundcubemail-plugin-ude_login.spec) 2>&1 && echo \$?"
[00:00:34] 0
[00:00:34] now running: ssh -f -o "StrictHostKeyChecking no" -o Port=22 -i /etc/lightbuildserver/container/container_rsa root@10.0.3.5 "export LC_ALL=C; (yum-builddep -y /tmp/roundcubemail-plugin-ude_login.spec) 2>&1 && echo \$?"
[00:00:34] Loaded plugins: fastestmirror, priorities
[00:00:34] Enabling epel-source repository
[00:00:34] Loading mirror speeds from cached hostfile
[00:00:38]  * base: centos.copahost.com
[00:00:38]  * epel: ftp.plusline.net
[00:00:38]  * epel-source: mirror.de.leaseweb.net
[00:00:38]  * extras: ftp.rz.uni-frankfurt.de
[00:00:38]  * updates: ftp.plusline.net
[00:00:45] 15 packages excluded due to repository priority protections
[00:00:45] Checking for new repos for mirrors
[00:00:45] Getting requirements for /tmp/roundcubemail-plugin-ude_login.spec
[00:00:45]  --> composer-1.8.0-1.el7.noarch
[00:00:45]  --> python-cssmin-0.2.0-3.el7.noarch
[00:00:45]  --> uglify-js-2.4.13-5.el7.noarch
[00:00:45]  --> Already installed : python-2.7.5-76.el7.x86_64
[00:00:45] --> Running transaction check
[00:00:45] ---> Package composer.noarch 0:1.8.0-1.el7 will be installed
[00:00:45] --> Processing Dependency: php-composer(seld/phar-utils) < 2 for package: composer-1.8.0-1.el7.noarch
[00:00:45] --> Processing Dependency: php-composer(seld/jsonlint) < 2 for package: composer-1.8.0-1.el7.noarch
[00:00:45] --> Processing Dependency: php-composer(psr/log) < 2 for package: composer-1.8.0-1.el7.noarch
[00:00:45] --> Processing Dependency: php-composer(composer/xdebug-handler) < 2 for package: composer-1.8.0-1.el7.noarch
[00:00:45] --> Processing Dependency: php-composer(composer/spdx-licenses) < 2 for package: composer-1.8.0-1.el7.noarch
[00:00:45] --> Processing Dependency: php-composer(composer/semver) < 2 for package: composer-1.8.0-1.el7.noarch
[00:00:45] --> Processing Dependency: php-composer(composer/ca-bundle) < 2 for package: composer-1.8.0-1.el7.noarch
[00:00:45] --> Processing Dependency: php-seld-phar-utils >= 1.0.1 for package: composer-1.8.0-1.el7.noarch
[00:00:45] --> Processing Dependency: php-composer(seld/phar-utils) >= 1.0 for package: composer-1.8.0-1.el7.noarch
[00:00:45] --> Processing Dependency: php-composer(seld/jsonlint) >= 1.4 for package: composer-1.8.0-1.el7.noarch
[00:00:45] --> Processing Dependency: php-composer(psr/log) >= 1.0 for package: composer-1.8.0-1.el7.noarch
[00:00:45] --> Processing Dependency: php-composer(composer/xdebug-handler) >= 1.1 for package: composer-1.8.0-1.el7.noarch
[00:00:45] --> Processing Dependency: php-composer(composer/spdx-licenses) >= 1.2 for package: composer-1.8.0-1.el7.noarch
[00:00:45] --> Processing Dependency: php-composer(composer/semver) >= 1.0 for package: composer-1.8.0-1.el7.noarch
[00:00:45] --> Processing Dependency: php-composer(composer/ca-bundle) >= 1.0 for package: composer-1.8.0-1.el7.noarch
[00:00:45] --> Processing Dependency: php-PsrLog >= 1.0.0-8 for package: composer-1.8.0-1.el7.noarch
[00:00:45] --> Processing Dependency: php(language) >= 5.3.2 for package: composer-1.8.0-1.el7.noarch
[00:00:45] --> Processing Dependency: php-zlib for package: composer-1.8.0-1.el7.noarch
[00:00:45] --> Processing Dependency: php-zip for package: composer-1.8.0-1.el7.noarch
[00:00:45] --> Processing Dependency: php-xsl for package: composer-1.8.0-1.el7.noarch
[00:00:45] --> Processing Dependency: php-tokenizer for package: composer-1.8.0-1.el7.noarch
[00:00:45] --> Processing Dependency: php-symfony-process for package: composer-1.8.0-1.el7.noarch
[00:00:45] --> Processing Dependency: php-symfony-finder for package: composer-1.8.0-1.el7.noarch
[00:00:45] --> Processing Dependency: php-symfony-filesystem for package: composer-1.8.0-1.el7.noarch
[00:00:45] --> Processing Dependency: php-symfony-console for package: composer-1.8.0-1.el7.noarch
[00:00:45] --> Processing Dependency: php-spl for package: composer-1.8.0-1.el7.noarch
[00:00:45] --> Processing Dependency: php-simplexml for package: composer-1.8.0-1.el7.noarch
[00:00:45] --> Processing Dependency: php-reflection for package: composer-1.8.0-1.el7.noarch
[00:00:45] --> Processing Dependency: php-phar for package: composer-1.8.0-1.el7.noarch
[00:00:45] --> Processing Dependency: php-pcre for package: composer-1.8.0-1.el7.noarch
[00:00:45] --> Processing Dependency: php-openssl for package: composer-1.8.0-1.el7.noarch
[00:00:45] --> Processing Dependency: php-mbstring for package: composer-1.8.0-1.el7.noarch
[00:00:45] --> Processing Dependency: php-libxml for package: composer-1.8.0-1.el7.noarch
[00:00:45] --> Processing Dependency: php-justinrainbow-json-schema5 for package: composer-1.8.0-1.el7.noarch
[00:00:45] --> Processing Dependency: php-json for package: composer-1.8.0-1.el7.noarch
[00:00:45] --> Processing Dependency: php-intl for package: composer-1.8.0-1.el7.noarch
[00:00:45] --> Processing Dependency: php-iconv for package: composer-1.8.0-1.el7.noarch
[00:00:45] --> Processing Dependency: php-hash for package: composer-1.8.0-1.el7.noarch
[00:00:45] --> Processing Dependency: php-filter for package: composer-1.8.0-1.el7.noarch
[00:00:45] --> Processing Dependency: php-dom for package: composer-1.8.0-1.el7.noarch
[00:00:45] --> Processing Dependency: php-date for package: composer-1.8.0-1.el7.noarch
[00:00:45] --> Processing Dependency: php-curl for package: composer-1.8.0-1.el7.noarch
[00:00:45] --> Processing Dependency: php-composer(fedora/autoloader) for package: composer-1.8.0-1.el7.noarch
[00:00:45] --> Processing Dependency: php-cli for package: composer-1.8.0-1.el7.noarch
[00:00:45] ---> Package python-cssmin.noarch 0:0.2.0-3.el7 will be installed
[00:00:45] --> Processing Dependency: python-setuptools for package: python-cssmin-0.2.0-3.el7.noarch
[00:00:45] ---> Package uglify-js.noarch 0:2.4.13-5.el7 will be installed
[00:00:45] --> Processing Dependency: js-uglify = 2.4.13-5.el7 for package: uglify-js-2.4.13-5.el7.noarch
[00:00:45] --> Processing Dependency: npm(uglify-to-browserify) < 1.1 for package: uglify-js-2.4.13-5.el7.noarch
[00:00:45] --> Processing Dependency: npm(source-map) < 0.2 for package: uglify-js-2.4.13-5.el7.noarch
[00:00:45] --> Processing Dependency: npm(optimist) < 0.5 for package: uglify-js-2.4.13-5.el7.noarch
[00:00:45] --> Processing Dependency: npm(async) < 0.3 for package: uglify-js-2.4.13-5.el7.noarch
[00:00:45] --> Processing Dependency: npm(uglify-to-browserify) >= 1.0.0 for package: uglify-js-2.4.13-5.el7.noarch
[00:00:45] --> Processing Dependency: npm(source-map) >= 0.1.33 for package: uglify-js-2.4.13-5.el7.noarch
[00:00:45] --> Processing Dependency: npm(optimist) >= 0.4 for package: uglify-js-2.4.13-5.el7.noarch
[00:00:45] --> Processing Dependency: npm(async) >= 0.2.6 for package: uglify-js-2.4.13-5.el7.noarch
[00:00:45] --> Processing Dependency: nodejs(engine) >= 0.4.0 for package: uglify-js-2.4.13-5.el7.noarch
[00:00:45] --> Running transaction check
[00:00:45] ---> Package js-uglify.noarch 0:2.4.13-5.el7 will be installed
[00:00:45] ---> Package nodejs.x86_64 1:6.14.3-1.el7 will be installed
[00:00:45] --> Processing Dependency: npm = 1:3.10.10-1.6.14.3.1.el7 for package: 1:nodejs-6.14.3-1.el7.x86_64
[00:00:45] --> Processing Dependency: libuv >= 1:1.9.1 for package: 1:nodejs-6.14.3-1.el7.x86_64
[00:00:45] --> Processing Dependency: http-parser >= 2.7.0 for package: 1:nodejs-6.14.3-1.el7.x86_64
[00:00:45] --> Processing Dependency: libuv.so.1()(64bit) for package: 1:nodejs-6.14.3-1.el7.x86_64
[00:00:45] --> Processing Dependency: libicuuc.so.50()(64bit) for package: 1:nodejs-6.14.3-1.el7.x86_64
[00:00:45] --> Processing Dependency: libicui18n.so.50()(64bit) for package: 1:nodejs-6.14.3-1.el7.x86_64
[00:00:45] --> Processing Dependency: libicudata.so.50()(64bit) for package: 1:nodejs-6.14.3-1.el7.x86_64
[00:00:45] --> Processing Dependency: libhttp_parser.so.2()(64bit) for package: 1:nodejs-6.14.3-1.el7.x86_64
[00:00:45] ---> Package nodejs-async.noarch 0:0.2.10-1.el7 will be installed
[00:00:45] ---> Package nodejs-optimist.noarch 0:0.4.0-1.el7 will be installed
[00:00:45] --> Processing Dependency: npm(wordwrap) < 0.1 for package: nodejs-optimist-0.4.0-1.el7.noarch
[00:00:45] --> Processing Dependency: npm(wordwrap) >= 0.0.2 for package: nodejs-optimist-0.4.0-1.el7.noarch
[00:00:45] ---> Package nodejs-source-map.noarch 0:0.1.33-1.el7 will be installed
[00:00:45] --> Processing Dependency: npm(amdefine) >= 0.0.4 for package: nodejs-source-map-0.1.33-1.el7.noarch
[00:00:45] ---> Package nodejs-uglify-to-browserify.noarch 0:1.0.2-2.el7 will be installed
[00:00:45] ---> Package php-PsrLog.noarch 0:1.1.0-1.el7 will be installed
[00:00:45] ---> Package php-cli.x86_64 0:5.4.16-46.el7 will be installed
[00:00:45] ---> Package php-common.x86_64 0:5.4.16-46.el7 will be installed
[00:00:45] --> Processing Dependency: libzip.so.2()(64bit) for package: php-common-5.4.16-46.el7.x86_64
[00:00:45] ---> Package php-composer-ca-bundle.noarch 0:1.0.2-1.el7 will be installed
[00:00:45] --> Processing Dependency: php-composer(symfony/class-loader) for package: php-composer-ca-bundle-1.0.2-1.el7.noarch
[00:00:45] ---> Package php-composer-semver.noarch 0:1.4.2-1.el7 will be installed
[00:00:45] ---> Package php-composer-spdx-licenses.noarch 0:1.5.0-1.el7 will be installed
[00:00:45] ---> Package php-composer-xdebug-handler.noarch 0:1.3.1-1.el7 will be installed
[00:00:45] --> Processing Dependency: php-posix for package: php-composer-xdebug-handler-1.3.1-1.el7.noarch
[00:00:45] ---> Package php-fedora-autoloader.noarch 0:1.0.0-1.el7 will be installed
[00:00:45] ---> Package php-intl.x86_64 0:5.4.16-46.el7 will be installed
[00:00:45] ---> Package php-jsonlint.noarch 0:1.6.1-1.el7 will be installed
[00:00:45] ---> Package php-justinrainbow-json-schema5.noarch 0:5.2.7-1.el7 will be installed
[00:00:45] ---> Package php-mbstring.x86_64 0:5.4.16-46.el7 will be installed
[00:00:45] ---> Package php-seld-phar-utils.noarch 0:1.0.1-1.el7 will be installed
[00:00:45] ---> Package php-symfony-console.noarch 0:2.8.12-2.el7 will be installed
[00:00:45] --> Processing Dependency: php-composer(symfony/event-dispatcher) = 2.8.12 for package: php-symfony-console-2.8.12-2.el7.noarch
[00:00:45] ---> Package php-symfony-filesystem.noarch 0:2.8.12-2.el7 will be installed
[00:00:45] --> Processing Dependency: php-symfony-common = 2.8.12-2.el7 for package: php-symfony-filesystem-2.8.12-2.el7.noarch
[00:00:45] ---> Package php-symfony-finder.noarch 0:2.8.12-2.el7 will be installed
[00:00:45] ---> Package php-symfony-process.noarch 0:2.8.12-2.el7 will be installed
[00:00:45] ---> Package php-xml.x86_64 0:5.4.16-46.el7 will be installed
[00:00:45] --> Processing Dependency: libxslt.so.1(LIBXML2_1.0.24)(64bit) for package: php-xml-5.4.16-46.el7.x86_64
[00:00:45] --> Processing Dependency: libxslt.so.1(LIBXML2_1.0.22)(64bit) for package: php-xml-5.4.16-46.el7.x86_64
[00:00:45] --> Processing Dependency: libxslt.so.1(LIBXML2_1.0.18)(64bit) for package: php-xml-5.4.16-46.el7.x86_64
[00:00:45] --> Processing Dependency: libxslt.so.1(LIBXML2_1.0.13)(64bit) for package: php-xml-5.4.16-46.el7.x86_64
[00:00:45] --> Processing Dependency: libxslt.so.1(LIBXML2_1.0.11)(64bit) for package: php-xml-5.4.16-46.el7.x86_64
[00:00:45] --> Processing Dependency: libxslt.so.1()(64bit) for package: php-xml-5.4.16-46.el7.x86_64
[00:00:45] --> Processing Dependency: libexslt.so.0()(64bit) for package: php-xml-5.4.16-46.el7.x86_64
[00:00:45] ---> Package python-setuptools.noarch 0:0.9.8-7.el7 will be installed
[00:00:45] --> Processing Dependency: python-backports-ssl_match_hostname for package: python-setuptools-0.9.8-7.el7.noarch
[00:00:45] --> Running transaction check
[00:00:45] ---> Package http-parser.x86_64 0:2.7.1-5.el7_4 will be installed
[00:00:45] ---> Package libicu.x86_64 0:50.1.2-17.el7 will be installed
[00:00:45] ---> Package libuv.x86_64 1:1.23.2-1.el7 will be installed
[00:00:45] ---> Package libxslt.x86_64 0:1.1.28-5.el7 will be installed
[00:00:45] ---> Package libzip.x86_64 0:0.10.1-8.el7 will be installed
[00:00:45] ---> Package nodejs-amdefine.noarch 0:0.0.4-1.el7 will be installed
[00:00:45] ---> Package nodejs-wordwrap.noarch 0:0.0.2-4.el7 will be installed
[00:00:45] ---> Package npm.x86_64 1:3.10.10-1.6.14.3.1.el7 will be installed
[00:00:45] ---> Package php-process.x86_64 0:5.4.16-46.el7 will be installed
[00:00:45] ---> Package php-symfony-class-loader.noarch 0:2.8.12-2.el7 will be installed
[00:00:45] ---> Package php-symfony-common.noarch 0:2.8.12-2.el7 will be installed
[00:00:45] ---> Package php-symfony-event-dispatcher.noarch 0:2.8.12-2.el7 will be installed
[00:00:45] --> Processing Dependency: php-composer(symfony/http-kernel) = 2.8.12 for package: php-symfony-event-dispatcher-2.8.12-2.el7.noarch
[00:00:45] --> Processing Dependency: php-composer(symfony/dependency-injection) = 2.8.12 for package: php-symfony-event-dispatcher-2.8.12-2.el7.noarch
[00:00:45] ---> Package python-backports-ssl_match_hostname.noarch 0:3.5.0.1-1.el7 will be installed
[00:00:45] --> Processing Dependency: python-ipaddress for package: python-backports-ssl_match_hostname-3.5.0.1-1.el7.noarch
[00:00:45] --> Processing Dependency: python-backports for package: python-backports-ssl_match_hostname-3.5.0.1-1.el7.noarch
[00:00:45] --> Running transaction check
[00:00:45] ---> Package php-symfony-dependency-injection.noarch 0:2.8.12-2.el7 will be installed
[00:00:45] --> Processing Dependency: php-composer(symfony/yaml) = 2.8.12 for package: php-symfony-dependency-injection-2.8.12-2.el7.noarch
[00:00:45] --> Processing Dependency: php-composer(symfony/expression-language) = 2.8.12 for package: php-symfony-dependency-injection-2.8.12-2.el7.noarch
[00:00:45] --> Processing Dependency: php-composer(symfony/config) = 2.8.12 for package: php-symfony-dependency-injection-2.8.12-2.el7.noarch
[00:00:45] ---> Package php-symfony-http-kernel.noarch 0:2.8.12-2.el7 will be installed
[00:00:45] --> Processing Dependency: php-composer(symfony/var-dumper) = 2.8.12 for package: php-symfony-http-kernel-2.8.12-2.el7.noarch
[00:00:45] --> Processing Dependency: php-composer(symfony/http-foundation) = 2.8.12 for package: php-symfony-http-kernel-2.8.12-2.el7.noarch
[00:00:45] --> Processing Dependency: php-composer(symfony/debug) = 2.8.12 for package: php-symfony-http-kernel-2.8.12-2.el7.noarch
[00:00:45] --> Processing Dependency: php-composer(symfony/browser-kit) = 2.8.12 for package: php-symfony-http-kernel-2.8.12-2.el7.noarch
[00:00:45] --> Processing Dependency: php-sqlite3 for package: php-symfony-http-kernel-2.8.12-2.el7.noarch
[00:00:45] --> Processing Dependency: php-pdo for package: php-symfony-http-kernel-2.8.12-2.el7.noarch
[00:00:45] ---> Package python-backports.x86_64 0:1.0-8.el7 will be installed
[00:00:45] ---> Package python-ipaddress.noarch 0:1.0.16-2.el7 will be installed
[00:00:45] --> Running transaction check
[00:00:45] ---> Package php-pdo.x86_64 0:5.4.16-46.el7 will be installed
[00:00:45] ---> Package php-symfony-browser-kit.noarch 0:2.8.12-2.el7 will be installed
[00:00:45] --> Processing Dependency: php-composer(symfony/dom-crawler) = 2.8.12 for package: php-symfony-browser-kit-2.8.12-2.el7.noarch
[00:00:45] ---> Package php-symfony-config.noarch 0:2.8.12-2.el7 will be installed
[00:00:45] ---> Package php-symfony-debug.noarch 0:2.8.12-2.el7 will be installed
[00:00:45] ---> Package php-symfony-expression-language.noarch 0:2.8.12-2.el7 will be installed
[00:00:45] ---> Package php-symfony-http-foundation.noarch 0:2.8.12-2.el7 will be installed
[00:00:45] --> Processing Dependency: php-composer(symfony/polyfill-php55) < 2.0 for package: php-symfony-http-foundation-2.8.12-2.el7.noarch
[00:00:45] --> Processing Dependency: php-composer(symfony/polyfill-php54) < 2.0 for package: php-symfony-http-foundation-2.8.12-2.el7.noarch
[00:00:45] --> Processing Dependency: php-composer(symfony/polyfill-php55) >= 1.0 for package: php-symfony-http-foundation-2.8.12-2.el7.noarch
[00:00:45] --> Processing Dependency: php-composer(symfony/polyfill-php54) >= 1.0 for package: php-symfony-http-foundation-2.8.12-2.el7.noarch
[00:00:45] ---> Package php-symfony-var-dumper.noarch 0:2.8.12-2.el7 will be installed
[00:00:45] --> Processing Dependency: php-gd for package: php-symfony-var-dumper-2.8.12-2.el7.noarch
[00:00:46] ---> Package php-symfony-yaml.noarch 0:2.8.12-2.el7 will be installed
[00:00:46] --> Running transaction check
[00:00:46] ---> Package php-gd.x86_64 0:5.4.16-46.el7 will be installed
[00:00:46] --> Processing Dependency: libpng15.so.15(PNG15_0)(64bit) for package: php-gd-5.4.16-46.el7.x86_64
[00:00:46] --> Processing Dependency: libjpeg.so.62(LIBJPEG_6.2)(64bit) for package: php-gd-5.4.16-46.el7.x86_64
[00:00:46] --> Processing Dependency: libt1.so.5()(64bit) for package: php-gd-5.4.16-46.el7.x86_64
[00:00:46] --> Processing Dependency: libpng15.so.15()(64bit) for package: php-gd-5.4.16-46.el7.x86_64
[00:00:46] --> Processing Dependency: libjpeg.so.62()(64bit) for package: php-gd-5.4.16-46.el7.x86_64
[00:00:46] --> Processing Dependency: libfreetype.so.6()(64bit) for package: php-gd-5.4.16-46.el7.x86_64
[00:00:46] --> Processing Dependency: libXpm.so.4()(64bit) for package: php-gd-5.4.16-46.el7.x86_64
[00:00:46] --> Processing Dependency: libX11.so.6()(64bit) for package: php-gd-5.4.16-46.el7.x86_64
[00:00:46] ---> Package php-symfony-dom-crawler.noarch 0:2.8.12-2.el7 will be installed
[00:00:46] --> Processing Dependency: php-composer(symfony/css-selector) = 2.8.12 for package: php-symfony-dom-crawler-2.8.12-2.el7.noarch
[00:00:46] ---> Package php-symfony-polyfill.noarch 0:1.5.0-1.el7 will be installed
[00:00:46] --> Processing Dependency: php-composer(paragonie/random_compat) < 3.0 for package: php-symfony-polyfill-1.5.0-1.el7.noarch
[00:00:46] --> Processing Dependency: php-composer(ircmaxell/password-compat) < 2.0 for package: php-symfony-polyfill-1.5.0-1.el7.noarch
[00:00:46] --> Processing Dependency: php-composer(paragonie/random_compat) >= 1.0 for package: php-symfony-polyfill-1.5.0-1.el7.noarch
[00:00:46] --> Processing Dependency: php-composer(ircmaxell/password-compat) >= 1.0 for package: php-symfony-polyfill-1.5.0-1.el7.noarch
[00:00:46] --> Running transaction check
[00:00:46] ---> Package freetype.x86_64 0:2.8-12.el7 will be installed
[00:00:46] ---> Package libX11.x86_64 0:1.6.5-2.el7 will be installed
[00:00:46] --> Processing Dependency: libX11-common >= 1.6.5-2.el7 for package: libX11-1.6.5-2.el7.x86_64
[00:00:46] --> Processing Dependency: libxcb.so.1()(64bit) for package: libX11-1.6.5-2.el7.x86_64
[00:00:46] ---> Package libXpm.x86_64 0:3.5.12-1.el7 will be installed
[00:00:46] ---> Package libjpeg-turbo.x86_64 0:1.2.90-6.el7 will be installed
[00:00:46] ---> Package libpng.x86_64 2:1.5.13-7.el7_2 will be installed
[00:00:46] ---> Package php-paragonie-random-compat.noarch 0:2.0.12-1.el7 will be installed
[00:00:46] ---> Package php-password-compat.noarch 0:1.0.4-1.el7 will be installed
[00:00:46] ---> Package php-symfony-css-selector.noarch 0:2.8.12-2.el7 will be installed
[00:00:46] ---> Package t1lib.x86_64 0:5.1.2-14.el7 will be installed
[00:00:46] --> Running transaction check
[00:00:46] ---> Package libX11-common.noarch 0:1.6.5-2.el7 will be installed
[00:00:46] ---> Package libxcb.x86_64 0:1.13-1.el7 will be installed
[00:00:46] --> Processing Dependency: libXau.so.6()(64bit) for package: libxcb-1.13-1.el7.x86_64
[00:00:46] --> Running transaction check
[00:00:46] ---> Package libXau.x86_64 0:1.0.8-2.1.el7 will be installed
[00:00:46] --> Finished Dependency Resolution
[00:00:46] 
[00:00:46] Dependencies Resolved
[00:00:46] 
[00:00:46] ================================================================================
[00:00:46]  Package                             Arch   Version                  Repository
[00:00:46]                                                                            Size
[00:00:46] ================================================================================
[00:00:46] Installing:
[00:00:46]  composer                            noarch 1.8.0-1.el7              epel 386 k
[00:00:46]  python-cssmin                       noarch 0.2.0-3.el7              epel  11 k
[00:00:46]  uglify-js                           noarch 2.4.13-5.el7             epel  14 k
[00:00:46] Installing for dependencies:
[00:00:46]  freetype                            x86_64 2.8-12.el7               base 380 k
[00:00:46]  http-parser                         x86_64 2.7.1-5.el7_4            base  28 k
[00:00:46]  js-uglify                           noarch 2.4.13-5.el7             epel  65 k
[00:00:46]  libX11                              x86_64 1.6.5-2.el7              base 606 k
[00:00:46]  libX11-common                       noarch 1.6.5-2.el7              base 164 k
[00:00:46]  libXau                              x86_64 1.0.8-2.1.el7            base  29 k
[00:00:46]  libXpm                              x86_64 3.5.12-1.el7             base  55 k
[00:00:46]  libicu                              x86_64 50.1.2-17.el7            base 6.9 M
[00:00:46]  libjpeg-turbo                       x86_64 1.2.90-6.el7             base 134 k
[00:00:46]  libpng                              x86_64 2:1.5.13-7.el7_2         base 213 k
[00:00:46]  libuv                               x86_64 1:1.23.2-1.el7           epel 129 k
[00:00:46]  libxcb                              x86_64 1.13-1.el7               base 214 k
[00:00:46]  libxslt                             x86_64 1.1.28-5.el7             base 242 k
[00:00:46]  libzip                              x86_64 0.10.1-8.el7             base  48 k
[00:00:46]  nodejs                              x86_64 1:6.14.3-1.el7           epel 4.7 M
[00:00:46]  nodejs-amdefine                     noarch 0.0.4-1.el7              epel  10 k
[00:00:46]  nodejs-async                        noarch 0.2.10-1.el7             epel  21 k
[00:00:46]  nodejs-optimist                     noarch 0.4.0-1.el7              epel  15 k
[00:00:46]  nodejs-source-map                   noarch 0.1.33-1.el7             epel  26 k
[00:00:46]  nodejs-uglify-to-browserify         noarch 1.0.2-2.el7              epel 6.2 k
[00:00:46]  nodejs-wordwrap                     noarch 0.0.2-4.el7              epel 6.4 k
[00:00:46]  npm                                 x86_64 1:3.10.10-1.6.14.3.1.el7 epel 2.5 M
[00:00:46]  php-PsrLog                          noarch 1.1.0-1.el7              epel  13 k
[00:00:46]  php-cli                             x86_64 5.4.16-46.el7            base 2.7 M
[00:00:46]  php-common                          x86_64 5.4.16-46.el7            base 565 k
[00:00:46]  php-composer-ca-bundle              noarch 1.0.2-1.el7              epel  12 k
[00:00:46]  php-composer-semver                 noarch 1.4.2-1.el7              epel  17 k
[00:00:46]  php-composer-spdx-licenses          noarch 1.5.0-1.el7              epel  17 k
[00:00:46]  php-composer-xdebug-handler         noarch 1.3.1-1.el7              epel  18 k
[00:00:46]  php-fedora-autoloader               noarch 1.0.0-1.el7              epel 9.6 k
[00:00:46]  php-gd                              x86_64 5.4.16-46.el7            base 128 k
[00:00:46]  php-intl                            x86_64 5.4.16-46.el7            base  97 k
[00:00:46]  php-jsonlint                        noarch 1.6.1-1.el7              epel  17 k
[00:00:46]  php-justinrainbow-json-schema5      noarch 5.2.7-1.el7              epel  41 k
[00:00:46]  php-mbstring                        x86_64 5.4.16-46.el7            base 505 k
[00:00:46]  php-paragonie-random-compat         noarch 2.0.12-1.el7             epel  26 k
[00:00:46]  php-password-compat                 noarch 1.0.4-1.el7              epel  10 k
[00:00:46]  php-pdo                             x86_64 5.4.16-46.el7            base  99 k
[00:00:46]  php-process                         x86_64 5.4.16-46.el7            base  56 k
[00:00:46]  php-seld-phar-utils                 noarch 1.0.1-1.el7              epel 7.7 k
[00:00:46]  php-symfony-browser-kit             noarch 2.8.12-2.el7             epel  23 k
[00:00:46]  php-symfony-class-loader            noarch 2.8.12-2.el7             epel  26 k
[00:00:46]  php-symfony-common                  noarch 2.8.12-2.el7             epel 124 k
[00:00:46]  php-symfony-config                  noarch 2.8.12-2.el7             epel  51 k
[00:00:46]  php-symfony-console                 noarch 2.8.12-2.el7             epel  88 k
[00:00:46]  php-symfony-css-selector            noarch 2.8.12-2.el7             epel  37 k
[00:00:46]  php-symfony-debug                   noarch 2.8.12-2.el7             epel  36 k
[00:00:46]  php-symfony-dependency-injection    noarch 2.8.12-2.el7             epel  83 k
[00:00:46]  php-symfony-dom-crawler             noarch 2.8.12-2.el7             epel  30 k
[00:00:46]  php-symfony-event-dispatcher        noarch 2.8.12-2.el7             epel  24 k
[00:00:46]  php-symfony-expression-language     noarch 2.8.12-2.el7             epel  27 k
[00:00:46]  php-symfony-filesystem              noarch 2.8.12-2.el7             epel  22 k
[00:00:46]  php-symfony-finder                  noarch 2.8.12-2.el7             epel  38 k
[00:00:46]  php-symfony-http-foundation         noarch 2.8.12-2.el7             epel  93 k
[00:00:46]  php-symfony-http-kernel             noarch 2.8.12-2.el7             epel  99 k
[00:00:46]  php-symfony-polyfill                noarch 1.5.0-1.el7              epel  26 k
[00:00:46]  php-symfony-process                 noarch 2.8.12-2.el7             epel  32 k
[00:00:46]  php-symfony-var-dumper              noarch 2.8.12-2.el7             epel  48 k
[00:00:46]  php-symfony-yaml                    noarch 2.8.12-2.el7             epel  28 k
[00:00:46]  php-xml                             x86_64 5.4.16-46.el7            base 126 k
[00:00:46]  python-backports                    x86_64 1.0-8.el7                base 5.8 k
[00:00:46]  python-backports-ssl_match_hostname noarch 3.5.0.1-1.el7            base  13 k
[00:00:46]  python-ipaddress                    noarch 1.0.16-2.el7             base  34 k
[00:00:46]  python-setuptools                   noarch 0.9.8-7.el7              base 397 k
[00:00:46]  t1lib                               x86_64 5.1.2-14.el7             base 166 k
[00:00:46] 
[00:00:46] Transaction Summary
[00:00:46] ================================================================================
[00:00:46] Install  3 Packages (+65 Dependent packages)
[00:00:46] 
[00:00:46] Total size: 23 M
[00:00:46] Installed size: 80 M
[00:00:46] Downloading packages:
[00:00:46] warning: /var/cache/yum/x86_64/7/epel/packages/php-composer-spdx-licenses-1.5.0-1.el7.noarch.rpm: Header V3 RSA/SHA256 Signature, key ID 352c64e5: NOKEY
[00:00:46] Retrieving key from file:///etc/pki/rpm-gpg/RPM-GPG-KEY-EPEL-7
[00:00:46] Importing GPG key 0x352C64E5:
[00:00:46]  Userid     : "Fedora EPEL (7) <epel@fedoraproject.org>"
[00:00:46]  Fingerprint: 91e9 7d7c 4a5e 96f1 7f3e 888f 6a2f aea2 352c 64e5
[00:00:46]  Package    : epel-release-7-11.noarch (@extras)
[00:00:46]  From       : /etc/pki/rpm-gpg/RPM-GPG-KEY-EPEL-7
[00:00:46] Key imported successfully
[00:00:46] Running transaction check
[00:00:46] Running transaction test
[00:00:46] Transaction test succeeded
[00:00:46] Running transaction
[00:00:47]   Installing : libicu-50.1.2-17.el7.x86_64                                 1/68 
[00:00:47]   Installing : 2:libpng-1.5.13-7.el7_2.x86_64                              2/68 
[00:00:47]   Installing : freetype-2.8-12.el7.x86_64                                  3/68 
[00:00:47]   Installing : js-uglify-2.4.13-5.el7.noarch                               4/68 
[00:00:47]   Installing : python-ipaddress-1.0.16-2.el7.noarch                        5/68 
[00:00:47]   Installing : libXau-1.0.8-2.1.el7.x86_64                                 6/68 
[00:00:48]   Installing : libxcb-1.13-1.el7.x86_64                                    7/68 
[00:00:48]   Installing : 1:libuv-1.23.2-1.el7.x86_64                                 8/68 
[00:00:48]   Installing : python-backports-1.0-8.el7.x86_64                           9/68 
[00:00:48]   Installing : python-backports-ssl_match_hostname-3.5.0.1-1.el7.noarch   10/68 
[00:00:48]   Installing : python-setuptools-0.9.8-7.el7.noarch                       11/68 
[00:00:48]   Installing : libxslt-1.1.28-5.el7.x86_64                                12/68 
[00:00:48]   Installing : libzip-0.10.1-8.el7.x86_64                                 13/68 
[00:00:48]   Installing : php-common-5.4.16-46.el7.x86_64                            14/68 
[00:00:48]   Installing : php-mbstring-5.4.16-46.el7.x86_64                          15/68 
[00:00:48]   Installing : php-fedora-autoloader-1.0.0-1.el7.noarch                   16/68 
[00:00:48]   Installing : php-xml-5.4.16-46.el7.x86_64                               17/68 
[00:00:48]   Installing : php-PsrLog-1.1.0-1.el7.noarch                              18/68 
[00:00:48]   Installing : php-symfony-class-loader-2.8.12-2.el7.noarch               19/68 
[00:00:48]   Installing : php-symfony-common-2.8.12-2.el7.noarch                     20/68 
[00:00:49]   Installing : php-process-5.4.16-46.el7.x86_64                           21/68 
[00:00:49]   Installing : php-cli-5.4.16-46.el7.x86_64                               22/68 
[00:00:49]   Installing : php-symfony-process-2.8.12-2.el7.noarch                    23/68 
[00:00:49]   Installing : php-symfony-filesystem-2.8.12-2.el7.noarch                 24/68 
[00:00:49]   Installing : php-symfony-finder-2.8.12-2.el7.noarch                     25/68 
[00:00:49]   Installing : php-symfony-yaml-2.8.12-2.el7.noarch                       26/68 
[00:00:49]   Installing : php-symfony-config-2.8.12-2.el7.noarch                     27/68 
[00:00:49]   Installing : php-pdo-5.4.16-46.el7.x86_64                               28/68 
[00:00:49]   Installing : php-intl-5.4.16-46.el7.x86_64                              29/68 
[00:00:49]   Installing : php-justinrainbow-json-schema5-5.2.7-1.el7.noarch          30/68 
[00:00:49]   Installing : php-jsonlint-1.6.1-1.el7.noarch                            31/68 
[00:00:49]   Installing : php-composer-xdebug-handler-1.3.1-1.el7.noarch             32/68 
[00:00:49]   Installing : php-symfony-css-selector-2.8.12-2.el7.noarch               33/68 
[00:00:49]   Installing : php-symfony-dom-crawler-2.8.12-2.el7.noarch                34/68 
[00:00:49]   Installing : php-symfony-browser-kit-2.8.12-2.el7.noarch                35/68 
[00:00:49]   Installing : php-symfony-expression-language-2.8.12-2.el7.noarch        36/68 
[00:00:49]   Installing : php-symfony-dependency-injection-2.8.12-2.el7.noarch       37/68 
[00:00:49]   Installing : php-composer-ca-bundle-1.0.2-1.el7.noarch                  38/68 
[00:00:49]   Installing : php-composer-semver-1.4.2-1.el7.noarch                     39/68 
[00:00:49]   Installing : php-seld-phar-utils-1.0.1-1.el7.noarch                     40/68 
[00:00:49]   Installing : php-symfony-debug-2.8.12-2.el7.noarch                      41/68 
[00:00:49]   Installing : php-composer-spdx-licenses-1.5.0-1.el7.noarch              42/68 
[00:00:49]   Installing : php-password-compat-1.0.4-1.el7.noarch                     43/68 
[00:00:49]   Installing : php-paragonie-random-compat-2.0.12-1.el7.noarch            44/68 
[00:00:49]   Installing : php-symfony-polyfill-1.5.0-1.el7.noarch                    45/68 
[00:00:49]   Installing : php-symfony-http-foundation-2.8.12-2.el7.noarch            46/68 
[00:00:49]   Installing : libjpeg-turbo-1.2.90-6.el7.x86_64                          47/68 
[00:00:50]   Installing : libX11-common-1.6.5-2.el7.noarch                           48/68 
[00:00:50]   Installing : libX11-1.6.5-2.el7.x86_64                                  49/68 
[00:00:50]   Installing : libXpm-3.5.12-1.el7.x86_64                                 50/68 
[00:00:50]   Installing : t1lib-5.1.2-14.el7.x86_64                                  51/68 
[00:00:50]   Installing : php-gd-5.4.16-46.el7.x86_64                                52/68 
[00:00:50]   Installing : php-symfony-var-dumper-2.8.12-2.el7.noarch                 53/68 
[00:00:50]   Installing : php-symfony-console-2.8.12-2.el7.noarch                    54/68 
[00:00:50]   Installing : php-symfony-event-dispatcher-2.8.12-2.el7.noarch           55/68 
[00:00:50]   Installing : php-symfony-http-kernel-2.8.12-2.el7.noarch                56/68 
[00:00:50]   Installing : http-parser-2.7.1-5.el7_4.x86_64                           57/68 
[00:00:51]   Installing : 1:npm-3.10.10-1.6.14.3.1.el7.x86_64                        58/68 
[00:00:51]   Installing : 1:nodejs-6.14.3-1.el7.x86_64                               59/68 
[00:00:51]   Installing : nodejs-amdefine-0.0.4-1.el7.noarch                         60/68 
[00:00:51]   Installing : nodejs-source-map-0.1.33-1.el7.noarch                      61/68 
[00:00:51]   Installing : nodejs-wordwrap-0.0.2-4.el7.noarch                         62/68 
[00:00:51]   Installing : nodejs-optimist-0.4.0-1.el7.noarch                         63/68 
[00:00:51]   Installing : nodejs-uglify-to-browserify-1.0.2-2.el7.noarch             64/68 
[00:00:51]   Installing : nodejs-async-0.2.10-1.el7.noarch                           65/68 
[00:00:51]   Installing : uglify-js-2.4.13-5.el7.noarch                              66/68 
[00:00:51]   Installing : composer-1.8.0-1.el7.noarch                                67/68 
[00:00:51]   Installing : python-cssmin-0.2.0-3.el7.noarch                           68/68 
[00:00:51]   Verifying  : libXpm-3.5.12-1.el7.x86_64                                  1/68 
[00:00:51]   Verifying  : python-backports-ssl_match_hostname-3.5.0.1-1.el7.noarch    2/68 
[00:00:51]   Verifying  : php-composer-spdx-licenses-1.5.0-1.el7.noarch               3/68 
[00:00:51]   Verifying  : nodejs-amdefine-0.0.4-1.el7.noarch                          4/68 
[00:00:51]   Verifying  : php-composer-ca-bundle-1.0.2-1.el7.noarch                   5/68 
[00:00:51]   Verifying  : http-parser-2.7.1-5.el7_4.x86_64                            6/68 
[00:00:51]   Verifying  : php-fedora-autoloader-1.0.0-1.el7.noarch                    7/68 
[00:00:51]   Verifying  : php-symfony-finder-2.8.12-2.el7.noarch                      8/68 
[00:00:51]   Verifying  : libX11-common-1.6.5-2.el7.noarch                            9/68 
[00:00:51]   Verifying  : php-composer-xdebug-handler-1.3.1-1.el7.noarch             10/68 
[00:00:51]   Verifying  : nodejs-wordwrap-0.0.2-4.el7.noarch                         11/68 
[00:00:51]   Verifying  : 2:libpng-1.5.13-7.el7_2.x86_64                             12/68 
[00:00:51]   Verifying  : libxcb-1.13-1.el7.x86_64                                   13/68 
[00:00:51]   Verifying  : php-symfony-css-selector-2.8.12-2.el7.noarch               14/68 
[00:00:51]   Verifying  : python-setuptools-0.9.8-7.el7.noarch                       15/68 
[00:00:51]   Verifying  : uglify-js-2.4.13-5.el7.noarch                              16/68 
[00:00:51]   Verifying  : php-xml-5.4.16-46.el7.x86_64                               17/68 
[00:00:51]   Verifying  : libjpeg-turbo-1.2.90-6.el7.x86_64                          18/68 
[00:00:51]   Verifying  : php-composer-semver-1.4.2-1.el7.noarch                     19/68 
[00:00:51]   Verifying  : php-symfony-http-kernel-2.8.12-2.el7.noarch                20/68 
[00:00:51]   Verifying  : php-symfony-debug-2.8.12-2.el7.noarch                      21/68 
[00:00:51]   Verifying  : php-pdo-5.4.16-46.el7.x86_64                               22/68 
[00:00:52]   Verifying  : 1:npm-3.10.10-1.6.14.3.1.el7.x86_64                        23/68 
[00:00:52]   Verifying  : php-symfony-var-dumper-2.8.12-2.el7.noarch                 24/68 
[00:00:52]   Verifying  : libX11-1.6.5-2.el7.x86_64                                  25/68 
[00:00:52]   Verifying  : php-symfony-browser-kit-2.8.12-2.el7.noarch                26/68 
[00:00:52]   Verifying  : php-justinrainbow-json-schema5-5.2.7-1.el7.noarch          27/68 
[00:00:52]   Verifying  : libzip-0.10.1-8.el7.x86_64                                 28/68 
[00:00:52]   Verifying  : php-symfony-http-foundation-2.8.12-2.el7.noarch            29/68 
[00:00:52]   Verifying  : php-symfony-class-loader-2.8.12-2.el7.noarch               30/68 
[00:00:52]   Verifying  : php-intl-5.4.16-46.el7.x86_64                              31/68 
[00:00:52]   Verifying  : php-symfony-filesystem-2.8.12-2.el7.noarch                 32/68 
[00:00:52]   Verifying  : nodejs-uglify-to-browserify-1.0.2-2.el7.noarch             33/68 
[00:00:52]   Verifying  : t1lib-5.1.2-14.el7.x86_64                                  34/68 
[00:00:52]   Verifying  : composer-1.8.0-1.el7.noarch                                35/68 
[00:00:52]   Verifying  : php-symfony-expression-language-2.8.12-2.el7.noarch        36/68 
[00:00:52]   Verifying  : libicu-50.1.2-17.el7.x86_64                                37/68 
[00:00:52]   Verifying  : php-symfony-dom-crawler-2.8.12-2.el7.noarch                38/68 
[00:00:52]   Verifying  : libxslt-1.1.28-5.el7.x86_64                                39/68 
[00:00:52]   Verifying  : php-mbstring-5.4.16-46.el7.x86_64                          40/68 
[00:00:52]   Verifying  : php-symfony-yaml-2.8.12-2.el7.noarch                       41/68 
[00:00:52]   Verifying  : php-PsrLog-1.1.0-1.el7.noarch                              42/68 
[00:00:52]   Verifying  : python-backports-1.0-8.el7.x86_64                          43/68 
[00:00:52]   Verifying  : php-symfony-event-dispatcher-2.8.12-2.el7.noarch           44/68 
[00:00:52]   Verifying  : nodejs-optimist-0.4.0-1.el7.noarch                         45/68 
[00:00:52]   Verifying  : 1:libuv-1.23.2-1.el7.x86_64                                46/68 
[00:00:52]   Verifying  : php-symfony-process-2.8.12-2.el7.noarch                    47/68 
[00:00:52]   Verifying  : php-gd-5.4.16-46.el7.x86_64                                48/68 
[00:00:52]   Verifying  : php-password-compat-1.0.4-1.el7.noarch                     49/68 
[00:00:52]   Verifying  : nodejs-source-map-0.1.33-1.el7.noarch                      50/68 
[00:00:52]   Verifying  : php-symfony-dependency-injection-2.8.12-2.el7.noarch       51/68 
[00:00:52]   Verifying  : php-process-5.4.16-46.el7.x86_64                           52/68 
[00:00:52]   Verifying  : php-symfony-console-2.8.12-2.el7.noarch                    53/68 
[00:00:52]   Verifying  : php-symfony-polyfill-1.5.0-1.el7.noarch                    54/68 
[00:00:52]   Verifying  : libXau-1.0.8-2.1.el7.x86_64                                55/68 
[00:00:52]   Verifying  : 1:nodejs-6.14.3-1.el7.x86_64                               56/68 
[00:00:52]   Verifying  : php-paragonie-random-compat-2.0.12-1.el7.noarch            57/68 
[00:00:52]   Verifying  : php-seld-phar-utils-1.0.1-1.el7.noarch                     58/68 
[00:00:52]   Verifying  : freetype-2.8-12.el7.x86_64                                 59/68 
[00:00:52]   Verifying  : php-symfony-common-2.8.12-2.el7.noarch                     60/68 
[00:00:52]   Verifying  : python-ipaddress-1.0.16-2.el7.noarch                       61/68 
[00:00:52]   Verifying  : nodejs-async-0.2.10-1.el7.noarch                           62/68 
[00:00:52]   Verifying  : php-cli-5.4.16-46.el7.x86_64                               63/68 
[00:00:52]   Verifying  : php-jsonlint-1.6.1-1.el7.noarch                            64/68 
[00:00:52]   Verifying  : js-uglify-2.4.13-5.el7.noarch                              65/68 
[00:00:52]   Verifying  : php-common-5.4.16-46.el7.x86_64                            66/68 
[00:00:52]   Verifying  : python-cssmin-0.2.0-3.el7.noarch                           67/68 
[00:00:52]   Verifying  : php-symfony-config-2.8.12-2.el7.noarch                     68/68 
[00:00:52] 
[00:00:52] Installed:
[00:00:52]   composer.noarch 0:1.8.0-1.el7         python-cssmin.noarch 0:0.2.0-3.el7      
[00:00:52]   uglify-js.noarch 0:2.4.13-5.el7      
[00:00:52] 
[00:00:52] Dependency Installed:
[00:00:52]   freetype.x86_64 0:2.8-12.el7                                                  
[00:00:52]   http-parser.x86_64 0:2.7.1-5.el7_4                                            
[00:00:52]   js-uglify.noarch 0:2.4.13-5.el7                                               
[00:00:52]   libX11.x86_64 0:1.6.5-2.el7                                                   
[00:00:52]   libX11-common.noarch 0:1.6.5-2.el7                                            
[00:00:52]   libXau.x86_64 0:1.0.8-2.1.el7                                                 
[00:00:52]   libXpm.x86_64 0:3.5.12-1.el7                                                  
[00:00:52]   libicu.x86_64 0:50.1.2-17.el7                                                 
[00:00:52]   libjpeg-turbo.x86_64 0:1.2.90-6.el7                                           
[00:00:52]   libpng.x86_64 2:1.5.13-7.el7_2                                                
[00:00:52]   libuv.x86_64 1:1.23.2-1.el7                                                   
[00:00:52]   libxcb.x86_64 0:1.13-1.el7                                                    
[00:00:52]   libxslt.x86_64 0:1.1.28-5.el7                                                 
[00:00:52]   libzip.x86_64 0:0.10.1-8.el7                                                  
[00:00:52]   nodejs.x86_64 1:6.14.3-1.el7                                                  
[00:00:52]   nodejs-amdefine.noarch 0:0.0.4-1.el7                                          
[00:00:52]   nodejs-async.noarch 0:0.2.10-1.el7                                            
[00:00:52]   nodejs-optimist.noarch 0:0.4.0-1.el7                                          
[00:00:52]   nodejs-source-map.noarch 0:0.1.33-1.el7                                       
[00:00:52]   nodejs-uglify-to-browserify.noarch 0:1.0.2-2.el7                              
[00:00:52]   nodejs-wordwrap.noarch 0:0.0.2-4.el7                                          
[00:00:52]   npm.x86_64 1:3.10.10-1.6.14.3.1.el7                                           
[00:00:52]   php-PsrLog.noarch 0:1.1.0-1.el7                                               
[00:00:52]   php-cli.x86_64 0:5.4.16-46.el7                                                
[00:00:52]   php-common.x86_64 0:5.4.16-46.el7                                             
[00:00:52]   php-composer-ca-bundle.noarch 0:1.0.2-1.el7                                   
[00:00:52]   php-composer-semver.noarch 0:1.4.2-1.el7                                      
[00:00:52]   php-composer-spdx-licenses.noarch 0:1.5.0-1.el7                               
[00:00:52]   php-composer-xdebug-handler.noarch 0:1.3.1-1.el7                              
[00:00:52]   php-fedora-autoloader.noarch 0:1.0.0-1.el7                                    
[00:00:52]   php-gd.x86_64 0:5.4.16-46.el7                                                 
[00:00:52]   php-intl.x86_64 0:5.4.16-46.el7                                               
[00:00:52]   php-jsonlint.noarch 0:1.6.1-1.el7                                             
[00:00:52]   php-justinrainbow-json-schema5.noarch 0:5.2.7-1.el7                           
[00:00:52]   php-mbstring.x86_64 0:5.4.16-46.el7                                           
[00:00:52]   php-paragonie-random-compat.noarch 0:2.0.12-1.el7                             
[00:00:52]   php-password-compat.noarch 0:1.0.4-1.el7                                      
[00:00:52]   php-pdo.x86_64 0:5.4.16-46.el7                                                
[00:00:52]   php-process.x86_64 0:5.4.16-46.el7                                            
[00:00:52]   php-seld-phar-utils.noarch 0:1.0.1-1.el7                                      
[00:00:52]   php-symfony-browser-kit.noarch 0:2.8.12-2.el7                                 
[00:00:52]   php-symfony-class-loader.noarch 0:2.8.12-2.el7                                
[00:00:52]   php-symfony-common.noarch 0:2.8.12-2.el7                                      
[00:00:52]   php-symfony-config.noarch 0:2.8.12-2.el7                                      
[00:00:52]   php-symfony-console.noarch 0:2.8.12-2.el7                                     
[00:00:52]   php-symfony-css-selector.noarch 0:2.8.12-2.el7                                
[00:00:52]   php-symfony-debug.noarch 0:2.8.12-2.el7                                       
[00:00:52]   php-symfony-dependency-injection.noarch 0:2.8.12-2.el7                        
[00:00:52]   php-symfony-dom-crawler.noarch 0:2.8.12-2.el7                                 
[00:00:52]   php-symfony-event-dispatcher.noarch 0:2.8.12-2.el7                            
[00:00:52]   php-symfony-expression-language.noarch 0:2.8.12-2.el7                         
[00:00:52]   php-symfony-filesystem.noarch 0:2.8.12-2.el7                                  
[00:00:52]   php-symfony-finder.noarch 0:2.8.12-2.el7                                      
[00:00:52]   php-symfony-http-foundation.noarch 0:2.8.12-2.el7                             
[00:00:52]   php-symfony-http-kernel.noarch 0:2.8.12-2.el7                                 
[00:00:52]   php-symfony-polyfill.noarch 0:1.5.0-1.el7                                     
[00:00:52]   php-symfony-process.noarch 0:2.8.12-2.el7                                     
[00:00:52]   php-symfony-var-dumper.noarch 0:2.8.12-2.el7                                  
[00:00:52]   php-symfony-yaml.noarch 0:2.8.12-2.el7                                        
[00:00:52]   php-xml.x86_64 0:5.4.16-46.el7                                                
[00:00:52]   python-backports.x86_64 0:1.0-8.el7                                           
[00:00:52]   python-backports-ssl_match_hostname.noarch 0:3.5.0.1-1.el7                    
[00:00:52]   python-ipaddress.noarch 0:1.0.16-2.el7                                        
[00:00:52]   python-setuptools.noarch 0:0.9.8-7.el7                                        
[00:00:52]   t1lib.x86_64 0:5.1.2-14.el7                                                   
[00:00:52] 
[00:00:52] Complete!
[00:00:52] 0
[00:00:52] now running: ssh -f -o "StrictHostKeyChecking no" -o Port=22 -i /etc/lightbuildserver/container/container_rsa root@10.0.3.5 "export LC_ALL=C; (mydevice=\`ip -o route get to 8.8.8.8 | awk '{ print \$5 }'\`; myip=\`ip -o route get to 8.8.8.8 | awk '{ print \$7 }'\`; ip route add \$myip dev \$mydevice) 2>&1 && echo \$?"
[00:00:52] 0
[00:00:52] now running: ssh -f -o "StrictHostKeyChecking no" -o Port=22 -i /etc/lightbuildserver/container/container_rsa root@10.0.3.5 "export LC_ALL=C; (sed -i "s/0%{?suse_version}/0/g" lbs-TBitsKolab16Test/roundcubemail-plugin-ude_login/roundcubemail-plugin-ude_login.spec) 2>&1 && echo \$?"
[00:00:52] 0
[00:00:52] now running: ssh -f -o "StrictHostKeyChecking no" -o Port=22 -i /etc/lightbuildserver/container/container_rsa root@10.0.3.5 "export LC_ALL=C; (cp lbs-TBitsKolab16Test/roundcubemail-plugin-ude_login/roundcubemail-plugin-ude_login.spec rpmbuild/SPECS) 2>&1 && echo \$?"
[00:00:53] 0
[00:00:53] now running: ssh -f -o "StrictHostKeyChecking no" -o Port=22 -i /etc/lightbuildserver/container/container_rsa root@10.0.3.5 "export LC_ALL=C; (cp lbs-TBitsKolab16Test/roundcubemail-plugin-ude_login/* rpmbuild/SOURCES) 2>&1 && echo \$?"
[00:00:53] 0
[00:00:53] now running: ssh -f -o "StrictHostKeyChecking no" -o Port=22 -i /etc/lightbuildserver/container/container_rsa root@10.0.3.5 "export LC_ALL=C; (mv sources/* rpmbuild/SOURCES) 2>&1 && echo \$?"
[00:00:53] mv: cannot stat 'sources/*': No such file or directory
[00:00:53] now running: rsync -avz -e "ssh -i /etc/lightbuildserver/container/container_rsa -p 2222" root@build04lxc.lbs.solidcharity.com:/var/lib/lxc/005-build04lxc.lbs.solidcharity.com/rootfs/root/rpmbuild/SPECS/roundcubemail-plugin-ude_login.spec /tmp/tmpkdfidkxn
[00:00:53] receiving incremental file list
[00:00:53] roundcubemail-plugin-ude_login.spec
[00:00:53] 
[00:00:53] sent 43 bytes  received 3,847 bytes  2,593.33 bytes/sec
[00:00:53] total size is 22,371  speedup is 5.75
[00:00:53] now running: ssh -f -o "StrictHostKeyChecking no" -o Port=22 -i /etc/lightbuildserver/container/container_rsa root@10.0.3.5 "export LC_ALL=C; (sed -i -e 's/Release:.*%{release}/Release: 0/g' rpmbuild/SPECS/roundcubemail-plugin-ude_login.spec) 2>&1 && echo \$?"
[00:00:53] 0
[00:00:53] now running: ssh -f -o "StrictHostKeyChecking no" -o Port=22 -i /etc/lightbuildserver/container/container_rsa root@10.0.3.5 "export LC_ALL=C; (rpmbuild -ba rpmbuild/SPECS/roundcubemail-plugin-ude_login.spec) 2>&1 && echo \$?"
[00:00:54] Executing(%prep): /bin/sh -e /var/tmp/rpm-tmp.auYeqd
[00:00:54] + umask 022
[00:00:54] + cd /root/rpmbuild/BUILD
[00:00:54] + cd /root/rpmbuild/BUILD
[00:00:54] + rm -rf roundcubemail-plugin-ude_login-4.0.0
[00:00:54] + /usr/bin/mkdir -p roundcubemail-plugin-ude_login-4.0.0
[00:00:54] + cd roundcubemail-plugin-ude_login-4.0.0
[00:00:54] + /usr/bin/tar -xf -
[00:00:54] + /usr/bin/gzip -dc /root/rpmbuild/SOURCES/roundcubemail-plugin-ude_login-4.0.0.tar.gz
[00:00:54] + STATUS=0
[00:00:54] + '[' 0 -ne 0 ']'
[00:00:54] + /usr/bin/chmod -Rf a+rX,u+w,g-w,o-w .
[00:00:54] + rm roundcubemail-plugin-ude_login-4.0.0/plugins/ude_login/users.txt
[00:00:54] + rm roundcubemail-plugin-ude_login-4.0.0/plugins/ude_login/composer.json
[00:00:54] ++ sort
[00:00:54] ++ find roundcubemail-plugin-ude_login-4.0.0/plugins -mindepth 1 -maxdepth 1 -type d
[00:00:54] + for plugin in '$(find roundcubemail-plugin-ude_login-4.0.0/plugins -mindepth 1 -maxdepth 1 -type d | sort)'
[00:00:54] ++ echo roundcubemail-plugin-ude_login-4.0.0/plugins/ude_login
[00:00:54] +++ basename roundcubemail-plugin-ude_login-4.0.0/plugins/ude_login
[00:00:54] ++ /usr/bin/sed -e 's|roundcubemail-plugin-ude_login-4.0.0|roundcubemail-plugin-ude_login-plugin-ude_login-4.0.0|g'
[00:00:54] + target_dir=roundcubemail-plugin-ude_login-plugin-ude_login-4.0.0/plugins/ude_login
[00:00:54] ++ dirname roundcubemail-plugin-ude_login-plugin-ude_login-4.0.0/plugins/ude_login
[00:00:54] + /usr/bin/mkdir -p roundcubemail-plugin-ude_login-plugin-ude_login-4.0.0/plugins
[00:00:54] + cp -av roundcubemail-plugin-ude_login-4.0.0/plugins/ude_login roundcubemail-plugin-ude_login-plugin-ude_login-4.0.0/plugins/ude_login
[00:00:54] 'roundcubemail-plugin-ude_login-4.0.0/plugins/ude_login' -> 'roundcubemail-plugin-ude_login-plugin-ude_login-4.0.0/plugins/ude_login'
[00:00:54] 'roundcubemail-plugin-ude_login-4.0.0/plugins/ude_login/README.md' -> 'roundcubemail-plugin-ude_login-plugin-ude_login-4.0.0/plugins/ude_login/README.md'
[00:00:54] 'roundcubemail-plugin-ude_login-4.0.0/plugins/ude_login/ude_login.php' -> 'roundcubemail-plugin-ude_login-plugin-ude_login-4.0.0/plugins/ude_login/ude_login.php'
[00:00:54] 'roundcubemail-plugin-ude_login-4.0.0/plugins/ude_login/config.inc.php.dist' -> 'roundcubemail-plugin-ude_login-plugin-ude_login-4.0.0/plugins/ude_login/config.inc.php.dist'
[00:00:54] ++ basename roundcubemail-plugin-ude_login-4.0.0/plugins/ude_login
[00:00:54] + echo '%package -n roundcubemail-plugin-ude_login'
[00:00:54] ++ basename roundcubemail-plugin-ude_login-4.0.0/plugins/ude_login
[00:00:54] + echo 'Summary:        Plugin ude_login'
[00:00:54] + echo 'Group:          Applications/Internet'
[00:00:54] + echo 'Requires:       roundcubemail(core) >= %{roundcube_version}'
[00:00:54] ++ basename roundcubemail-plugin-ude_login-4.0.0/plugins/ude_login
[00:00:54] + echo 'Requires:       roundcubemail(plugin-ude_login-assets) = %{?epoch:%{epoch}:}%{version}-%{release}'
[00:00:54] + '[' -d roundcubemail-plugin-ude_login-4.0.0/plugins/ude_login/skins/ ']'
[00:00:54] ++ cut '-d'\''' -f2
[00:00:54] ++ grep -rn require_plugin roundcubemail-plugin-ude_login-4.0.0/plugins/ude_login/
[00:00:54] ++ sort
[00:00:54] ++ basename roundcubemail-plugin-ude_login-4.0.0/plugins/ude_login
[00:00:54] + '[' ude_login == kolab_files ']'
[00:00:54] ++ basename roundcubemail-plugin-ude_login-4.0.0/plugins/ude_login
[00:00:54] + '[' ude_login == kolab_2fa ']'
[00:00:54] ++ basename roundcubemail-plugin-ude_login-4.0.0/plugins/ude_login
[00:00:54] + '[' ude_login == html_converter ']'
[00:00:54] ++ basename roundcubemail-plugin-ude_login-4.0.0/plugins/ude_login
[00:00:54] + echo 'Provides:       roundcubemail(plugin-ude_login) = %{?epoch:%{epoch}:}%{version}-%{release}'
[00:00:54] + echo ''
[00:00:54] ++ basename roundcubemail-plugin-ude_login-4.0.0/plugins/ude_login
[00:00:54] + echo '%description -n roundcubemail-plugin-ude_login'
[00:00:54] ++ basename roundcubemail-plugin-ude_login-4.0.0/plugins/ude_login
[00:00:54] + echo 'Plugin ude_login'
[00:00:54] + echo ''
[00:00:54] ++ basename roundcubemail-plugin-ude_login-4.0.0/plugins/ude_login
[00:00:54] + echo '%files -f plugin-ude_login.files'
[00:00:54] + echo '%defattr(-,root,root,-)'
[00:00:54] + '[' -d roundcubemail-plugin-ude_login-4.0.0/plugins/ude_login/config -o -f roundcubemail-plugin-ude_login-4.0.0/plugins/ude_login/config.inc.php -o -f roundcubemail-plugin-ude_login-4.0.0/plugins/ude_login/config.inc.php.dist ']'
[00:00:54] ++ basename roundcubemail-plugin-ude_login-4.0.0/plugins/ude_login
[00:00:54] + echo '%attr(0640,root,%{httpd_group}) %config(noreplace) %{_sysconfdir}/roundcubemail/ude_login.inc.php'
[00:00:54] + echo ''
[00:00:54] + touch plugins.pre
[00:00:54] ++ basename roundcubemail-plugin-ude_login-4.0.0/plugins/ude_login
[00:00:54] + echo '%pre -n roundcubemail-plugin-ude_login'
[00:00:54] + echo 'if [ -f "%{_localstatedir}/lib/rpm-state/roundcubemail/httpd.restarted" ]; then'
[00:00:54] + echo '    %{__rm} -f "%{_localstatedir}/lib/rpm-state/roundcubemail/httpd.restarted"'
[00:00:54] + echo fi
[00:00:54] + echo ''
[00:00:54] + touch plugins.post
[00:00:54] ++ basename roundcubemail-plugin-ude_login-4.0.0/plugins/ude_login
[00:00:54] + echo '%posttrans -n roundcubemail-plugin-ude_login'
[00:00:54] + echo 'if [ ! -f "%{_localstatedir}/lib/rpm-state/roundcubemail/httpd.restarted" ]; then'
[00:00:54] + echo '    if [ -f "%{php_inidir}/apc.ini"  -o -f "%{php_inidir}/apcu.ini" ]; then'
[00:00:54] + echo '        if [ ! -z "$(grep ^apc.enabled=1 %{php_inidir}/apc{,u}.ini 2>/dev/null)" ]; then'
[00:00:54] + echo '%if 0%{?with_systemd}'
[00:00:54] + echo '            /bin/systemctl condrestart %{httpd_name}.service'
[00:00:54] + echo %else
[00:00:54] + echo '            /sbin/service %{httpd_name} condrestart'
[00:00:54] + echo %endif
[00:00:54] + echo '        fi'
[00:00:54] + echo '    fi'
[00:00:54] + echo '    %{__mkdir_p} %{_localstatedir}/lib/rpm-state/roundcubemail/'
[00:00:54] + echo '    touch %{_localstatedir}/lib/rpm-state/roundcubemail/httpd.restarted'
[00:00:54] + echo fi
[00:00:54] + echo ''
[00:00:54] ++ find roundcubemail-plugin-ude_login-4.0.0/plugins/ude_login -type d -name SQL
[00:00:54] + '[' '!' -z '' ']'
[00:00:54] + touch plugins-assets.packages
[00:00:54] ++ basename roundcubemail-plugin-ude_login-4.0.0/plugins/ude_login
[00:00:54] + echo '%package -n roundcubemail-plugin-ude_login-assets'
[00:00:54] ++ basename roundcubemail-plugin-ude_login-4.0.0/plugins/ude_login
[00:00:54] + echo 'Summary:        Plugin ude_login Assets'
[00:00:54] + echo 'Group:          Applications/Internet'
[00:00:54] ++ basename roundcubemail-plugin-ude_login-4.0.0/plugins/ude_login
[00:00:54] + echo 'Provides:       roundcubemail(plugin-ude_login-assets) = %{?epoch:%{epoch}:}%{version}-%{release}'
[00:00:54] + echo ''
[00:00:54] ++ basename roundcubemail-plugin-ude_login-4.0.0/plugins/ude_login
[00:00:54] + echo '%description -n roundcubemail-plugin-ude_login-assets'
[00:00:54] ++ basename roundcubemail-plugin-ude_login-4.0.0/plugins/ude_login
[00:00:54] + echo 'Plugin ude_login Assets'
[00:00:54] + echo ''
[00:00:54] + touch plugins-assets.files
[00:00:54] ++ basename roundcubemail-plugin-ude_login-4.0.0/plugins/ude_login
[00:00:54] ++ basename roundcubemail-plugin-ude_login-4.0.0/plugins/ude_login
[00:00:54] + echo '%files -n roundcubemail-plugin-ude_login-assets -f plugin-ude_login-assets.files'
[00:00:54] + echo '%defattr(-,root,root,-)'
[00:00:54] + echo ''
[00:00:54] + touch plugins-skins.packages
[00:00:54] + touch plugins-skins.files
[00:00:54] + touch plugins-skins-assets.packages
[00:00:54] + touch plugins-skins-assets.files
[00:00:54] + for skin in larry classic
[00:00:54] ++ sort
[00:00:54] ++ grep -v helpdocs
[00:00:54] ++ find roundcubemail-plugin-ude_login-plugin-ude_login-4.0.0/plugins/ude_login -type d -name larry
[00:00:54] + for skin in larry classic
[00:00:54] ++ find roundcubemail-plugin-ude_login-plugin-ude_login-4.0.0/plugins/ude_login -type d -name classic
[00:00:54] ++ grep -v helpdocs
[00:00:54] ++ sort
[00:00:54] + cat plugins.packages plugins-assets.packages plugins-skins.packages plugins-skins-assets.packages
[00:00:54] + cat plugins.files plugins-assets.files plugins-skins.files plugins-skins-assets.files
[00:00:54] + find
[00:00:54] + tee files.find
[00:00:54] + sort
[00:00:54] + exit 0
[00:00:54] Executing(%build): /bin/sh -e /var/tmp/rpm-tmp.jHPwnu
[00:00:54] + umask 022
[00:00:54] + cd /root/rpmbuild/BUILD
[00:00:54] + cd roundcubemail-plugin-ude_login-4.0.0
[00:00:54] + exit 0
[00:00:54] Executing(%install): /bin/sh -e /var/tmp/rpm-tmp.o1bylL
[00:00:54] + umask 022
[00:00:54] + cd /root/rpmbuild/BUILD
[00:00:54] + '[' /root/rpmbuild/BUILDROOT/roundcubemail-plugin-ude_login-4.0.0-107.tbits20190107.el7.x86_64 '!=' / ']'
[00:00:54] + rm -rf /root/rpmbuild/BUILDROOT/roundcubemail-plugin-ude_login-4.0.0-107.tbits20190107.el7.x86_64
[00:00:54] ++ dirname /root/rpmbuild/BUILDROOT/roundcubemail-plugin-ude_login-4.0.0-107.tbits20190107.el7.x86_64
[00:00:54] + mkdir -p /root/rpmbuild/BUILDROOT
[00:00:54] + mkdir /root/rpmbuild/BUILDROOT/roundcubemail-plugin-ude_login-4.0.0-107.tbits20190107.el7.x86_64
[00:00:54] + cd roundcubemail-plugin-ude_login-4.0.0
[00:00:54] + /usr/bin/install -pm 755 /root/rpmbuild/SOURCES/comm.py .
[00:00:54] + /usr/bin/rm -rf /root/rpmbuild/BUILDROOT/roundcubemail-plugin-ude_login-4.0.0-107.tbits20190107.el7.x86_64
[00:00:54] + /usr/bin/install -d /root/rpmbuild/BUILDROOT/roundcubemail-plugin-ude_login-4.0.0-107.tbits20190107.el7.x86_64/etc/roundcubemail /root/rpmbuild/BUILDROOT/roundcubemail-plugin-ude_login-4.0.0-107.tbits20190107.el7.x86_64/usr/share/roundcubemail/public_html /root/rpmbuild/BUILDROOT/roundcubemail-plugin-ude_login-4.0.0-107.tbits20190107.el7.x86_64/usr/share/roundcubemail/plugins
[00:00:54] + '[' -d /root/rpmbuild/BUILDROOT/roundcubemail-plugin-ude_login-4.0.0-107.tbits20190107.el7.x86_64/usr/share/roundcubemail/public_html/ ']'
[00:00:54] + asset_path=/root/rpmbuild/BUILDROOT/roundcubemail-plugin-ude_login-4.0.0-107.tbits20190107.el7.x86_64/usr/share/roundcubemail/public_html/assets
[00:00:54] + /usr/bin/mkdir -p /root/rpmbuild/BUILDROOT/roundcubemail-plugin-ude_login-4.0.0-107.tbits20190107.el7.x86_64/usr/share/roundcubemail/public_html/assets
[00:00:54] + echo =================================================================
[00:00:54] =================================================================
[00:00:54] + echo 'Dividing Plugins, Plugin Assets, Plugin Skins and Plugin Skin Assets and Non-Assets'
[00:00:54] Dividing Plugins, Plugin Assets, Plugin Skins and Plugin Skin Assets and Non-Assets
[00:00:54] + echo =================================================================
[00:00:54] =================================================================
[00:00:54] ++ find roundcubemail-plugin-ude_login-4.0.0/plugins/ -mindepth 1 -maxdepth 1 -type d -exec basename '{}' ';'
[00:00:54] ++ sort
[00:00:54] + for plugin in '$(find roundcubemail-plugin-ude_login-4.0.0/plugins/ -mindepth 1 -maxdepth 1 -type d -exec basename {} \; | sort)'
[00:00:54] + for skin in larry classic
[00:00:54] + orig_dir=roundcubemail-plugin-ude_login-plugin-ude_login-skin-larry-4.0.0
[00:00:54] + asset_dir=roundcubemail-plugin-ude_login-plugin-ude_login-skin-larry-assets-4.0.0
[00:00:54] ++ find roundcubemail-plugin-ude_login-plugin-ude_login-skin-larry-4.0.0 -type f -name '*.css'
[00:00:54] find: 'roundcubemail-plugin-ude_login-plugin-ude_login-skin-larry-4.0.0': No such file or directory
[00:00:54] ++ find roundcubemail-plugin-ude_login-plugin-ude_login-skin-larry-4.0.0 -type f -name '*.js' '!' -name '*.min.js'
[00:00:54] find: 'roundcubemail-plugin-ude_login-plugin-ude_login-skin-larry-4.0.0': No such file or directory
[00:00:54] ++ find roundcubemail-plugin-ude_login-plugin-ude_login-skin-larry-4.0.0 -type f -name '*.min.js'
[00:00:54] find: 'roundcubemail-plugin-ude_login-plugin-ude_login-skin-larry-4.0.0': No such file or directory
[00:00:54] ++ find roundcubemail-plugin-ude_login-plugin-ude_login-skin-larry-4.0.0 -type f -name '*.eot' -o -name '*.gif' -o -name '*.ico' -o -name '*.jpg' -o -name '*.mp3' -o -name '*.png' -o -name '*.svg' -o -name '*.swf' -o -name '*.tif' -o -name '*.ttf' -o -name '*.woff'
[00:00:54] find: 'roundcubemail-plugin-ude_login-plugin-ude_login-skin-larry-4.0.0': No such file or directory
[00:00:54] + find roundcubemail-plugin-ude_login-plugin-ude_login-skin-larry-4.0.0 -type d -empty -delete
[00:00:54] find: 'roundcubemail-plugin-ude_login-plugin-ude_login-skin-larry-4.0.0': No such file or directory
[00:00:54] + :
[00:00:54] + for skin in larry classic
[00:00:54] + orig_dir=roundcubemail-plugin-ude_login-plugin-ude_login-skin-classic-4.0.0
[00:00:54] + asset_dir=roundcubemail-plugin-ude_login-plugin-ude_login-skin-classic-assets-4.0.0
[00:00:54] ++ find roundcubemail-plugin-ude_login-plugin-ude_login-skin-classic-4.0.0 -type f -name '*.css'
[00:00:54] find: 'roundcubemail-plugin-ude_login-plugin-ude_login-skin-classic-4.0.0': No such file or directory
[00:00:54] ++ find roundcubemail-plugin-ude_login-plugin-ude_login-skin-classic-4.0.0 -type f -name '*.js' '!' -name '*.min.js'
[00:00:54] find: 'roundcubemail-plugin-ude_login-plugin-ude_login-skin-classic-4.0.0': No such file or directory
[00:00:54] ++ find roundcubemail-plugin-ude_login-plugin-ude_login-skin-classic-4.0.0 -type f -name '*.min.js'
[00:00:54] find: 'roundcubemail-plugin-ude_login-plugin-ude_login-skin-classic-4.0.0': No such file or directory
[00:00:54] ++ find roundcubemail-plugin-ude_login-plugin-ude_login-skin-classic-4.0.0 -type f -name '*.eot' -o -name '*.gif' -o -name '*.ico' -o -name '*.jpg' -o -name '*.mp3' -o -name '*.png' -o -name '*.svg' -o -name '*.swf' -o -name '*.tif' -o -name '*.ttf' -o -name '*.woff'
[00:00:54] find: 'roundcubemail-plugin-ude_login-plugin-ude_login-skin-classic-4.0.0': No such file or directory
[00:00:54] + find roundcubemail-plugin-ude_login-plugin-ude_login-skin-classic-4.0.0 -type d -empty -delete
[00:00:54] find: 'roundcubemail-plugin-ude_login-plugin-ude_login-skin-classic-4.0.0': No such file or directory
[00:00:54] + :
[00:00:54] + orig_dir=roundcubemail-plugin-ude_login-plugin-ude_login-4.0.0
[00:00:54] + asset_dir=roundcubemail-plugin-ude_login-plugin-ude_login-assets-4.0.0
[00:00:54] ++ find roundcubemail-plugin-ude_login-plugin-ude_login-4.0.0 -type f -name '*.css'
[00:00:54] ++ find roundcubemail-plugin-ude_login-plugin-ude_login-4.0.0 -type f -name '*.js' '!' -name '*.min.js'
[00:00:54] ++ find roundcubemail-plugin-ude_login-plugin-ude_login-4.0.0 -type f -name '*.min.js'
[00:00:54] ++ find roundcubemail-plugin-ude_login-plugin-ude_login-4.0.0 -type f -name '*.eot' -o -name '*.gif' -o -name '*.ico' -o -name '*.jpg' -o -name '*.mp3' -o -name '*.png' -o -name '*.svg' -o -name '*.swf' -o -name '*.tif' -o -name '*.ttf' -o -name '*.woff'
[00:00:54] + '[' ude_login == pdfviewer ']'
[00:00:54] + find roundcubemail-plugin-ude_login-plugin-ude_login-4.0.0 -type d -empty -delete
[00:00:54] ++ find roundcubemail-plugin-ude_login-plugin-ude_login-assets-4.0.0 -type f
[00:00:54] find: 'roundcubemail-plugin-ude_login-plugin-ude_login-assets-4.0.0': No such file or directory
[00:00:54] + new_files
[00:00:54] + find /root/rpmbuild/BUILDROOT/roundcubemail-plugin-ude_login-4.0.0-107.tbits20190107.el7.x86_64/usr/share/roundcubemail -type d -exec echo '%dir {}' ';'
[00:00:54] + find /root/rpmbuild/BUILDROOT/roundcubemail-plugin-ude_login-4.0.0-107.tbits20190107.el7.x86_64/usr/share/roundcubemail -type f
[00:00:54] + find /root/rpmbuild/BUILDROOT/roundcubemail-plugin-ude_login-4.0.0-107.tbits20190107.el7.x86_64/usr/share/roundcubemail -type l
[00:00:54] + '[' -f current.files ']'
[00:00:54] + cat current-new.files
[00:00:54] + /usr/bin/mv current-new.files current.files
[00:00:54] + echo '== Files for plugin ude_login: =='
[00:00:54] == Files for plugin ude_login: ==
[00:00:54] + cat plugin-ude_login-assets.files
[00:00:54] %dir /root/rpmbuild/BUILDROOT/roundcubemail-plugin-ude_login-4.0.0-107.tbits20190107.el7.x86_64/usr/share/roundcubemail
[00:00:54] %dir /root/rpmbuild/BUILDROOT/roundcubemail-plugin-ude_login-4.0.0-107.tbits20190107.el7.x86_64/usr/share/roundcubemail/public_html
[00:00:54] %dir /root/rpmbuild/BUILDROOT/roundcubemail-plugin-ude_login-4.0.0-107.tbits20190107.el7.x86_64/usr/share/roundcubemail/public_html/assets
[00:00:54] %dir /root/rpmbuild/BUILDROOT/roundcubemail-plugin-ude_login-4.0.0-107.tbits20190107.el7.x86_64/usr/share/roundcubemail/plugins
[00:00:54] + echo ===========================
[00:00:54] ===========================
[00:00:54] + /usr/bin/mkdir -p /root/rpmbuild/BUILDROOT/roundcubemail-plugin-ude_login-4.0.0-107.tbits20190107.el7.x86_64/usr/share/roundcubemail/plugins
[00:00:54] + cp -a roundcubemail-plugin-ude_login-plugin-ude_login-4.0.0/plugins/ude_login /root/rpmbuild/BUILDROOT/roundcubemail-plugin-ude_login-4.0.0-107.tbits20190107.el7.x86_64/usr/share/roundcubemail/plugins/.
[00:00:54] + '[' -f /root/rpmbuild/BUILDROOT/roundcubemail-plugin-ude_login-4.0.0-107.tbits20190107.el7.x86_64/usr/share/roundcubemail/plugins/ude_login/config.inc.php.dist ']'
[00:00:54] + pushd /root/rpmbuild/BUILDROOT/roundcubemail-plugin-ude_login-4.0.0-107.tbits20190107.el7.x86_64/usr/share/roundcubemail/plugins/ude_login
[00:00:54] ~/rpmbuild/BUILDROOT/roundcubemail-plugin-ude_login-4.0.0-107.tbits20190107.el7.x86_64/usr/share/roundcubemail/plugins/ude_login ~/rpmbuild/BUILD/roundcubemail-plugin-ude_login-4.0.0
[00:00:54] + /usr/bin/mv config.inc.php.dist /root/rpmbuild/BUILDROOT/roundcubemail-plugin-ude_login-4.0.0-107.tbits20190107.el7.x86_64/etc/roundcubemail/ude_login.inc.php
[00:00:54] + ln -s ../../../../../etc/roundcubemail/ude_login.inc.php config.inc.php
[00:00:54] + popd
[00:00:54] ~/rpmbuild/BUILD/roundcubemail-plugin-ude_login-4.0.0
[00:00:54] + '[' -f /root/rpmbuild/BUILDROOT/roundcubemail-plugin-ude_login-4.0.0-107.tbits20190107.el7.x86_64/usr/share/roundcubemail/plugins/ude_login/logon_page.html ']'
[00:00:54] + new_files
[00:00:54] + find /root/rpmbuild/BUILDROOT/roundcubemail-plugin-ude_login-4.0.0-107.tbits20190107.el7.x86_64/usr/share/roundcubemail -type d -exec echo '%dir {}' ';'
[00:00:54] + find /root/rpmbuild/BUILDROOT/roundcubemail-plugin-ude_login-4.0.0-107.tbits20190107.el7.x86_64/usr/share/roundcubemail -type f
[00:00:54] + find /root/rpmbuild/BUILDROOT/roundcubemail-plugin-ude_login-4.0.0-107.tbits20190107.el7.x86_64/usr/share/roundcubemail -type l
[00:00:54] + '[' -f current.files ']'
[00:00:54] + /usr/bin/python ./comm.py current.files current-new.files
[00:00:54] + /usr/bin/mv current-new.files current.files
[00:00:54] + echo '== Files for plugin ude_login: =='
[00:00:54] == Files for plugin ude_login: ==
[00:00:54] + cat plugin-ude_login.files
[00:00:54] %dir /root/rpmbuild/BUILDROOT/roundcubemail-plugin-ude_login-4.0.0-107.tbits20190107.el7.x86_64/usr/share/roundcubemail/plugins/ude_login
[00:00:54] /root/rpmbuild/BUILDROOT/roundcubemail-plugin-ude_login-4.0.0-107.tbits20190107.el7.x86_64/usr/share/roundcubemail/plugins/ude_login/README.md
[00:00:54] /root/rpmbuild/BUILDROOT/roundcubemail-plugin-ude_login-4.0.0-107.tbits20190107.el7.x86_64/usr/share/roundcubemail/plugins/ude_login/ude_login.php
[00:00:54] /root/rpmbuild/BUILDROOT/roundcubemail-plugin-ude_login-4.0.0-107.tbits20190107.el7.x86_64/usr/share/roundcubemail/plugins/ude_login/config.inc.php
[00:00:55] 
[00:00:55] + echo ===========================
[00:00:55] ===========================
[00:00:55] ++ find roundcubemail-plugin-ude_login-4.0.0/plugins/ -mindepth 1 -maxdepth 1 -type d -exec basename '{}' ';'
[00:00:55] ++ sort
[00:00:55] + for plugin in '$(find roundcubemail-plugin-ude_login-4.0.0/plugins/ -mindepth 1 -maxdepth 1 -type d -exec basename {} \; | sort)'
[00:00:55] + for skin in larry classic
[00:00:55] + touch plugin-ude_login-skin-larry.files
[00:00:55] + touch plugin-ude_login-skin-larry-assets.files
[00:00:55] + '[' -d roundcubemail-plugin-ude_login-plugin-ude_login-skin-larry-4.0.0/plugins/ude_login/skins/larry ']'
[00:00:55] ++ find roundcubemail-plugin-ude_login-plugin-ude_login-skin-larry-assets-4.0.0 -type f
[00:00:55] find: 'roundcubemail-plugin-ude_login-plugin-ude_login-skin-larry-assets-4.0.0': No such file or directory
[00:00:55] + new_files
[00:00:55] + find /root/rpmbuild/BUILDROOT/roundcubemail-plugin-ude_login-4.0.0-107.tbits20190107.el7.x86_64/usr/share/roundcubemail -type d -exec echo '%dir {}' ';'
[00:00:55] + find /root/rpmbuild/BUILDROOT/roundcubemail-plugin-ude_login-4.0.0-107.tbits20190107.el7.x86_64/usr/share/roundcubemail -type f
[00:00:55] + find /root/rpmbuild/BUILDROOT/roundcubemail-plugin-ude_login-4.0.0-107.tbits20190107.el7.x86_64/usr/share/roundcubemail -type l
[00:00:55] + '[' -f current.files ']'
[00:00:55] + /usr/bin/python ./comm.py current.files current-new.files
[00:00:55] + /usr/bin/mv current-new.files current.files
[00:00:55] + echo '== Files for skin ude_login-larry: =='
[00:00:55] == Files for skin ude_login-larry: ==
[00:00:55] + cat plugin-ude_login-skin-larry-assets.files
[00:00:55] 
[00:00:55] + echo ===========================
[00:00:55] ===========================
[00:00:55] + for skin in larry classic
[00:00:55] + touch plugin-ude_login-skin-classic.files
[00:00:55] + touch plugin-ude_login-skin-classic-assets.files
[00:00:55] + '[' -d roundcubemail-plugin-ude_login-plugin-ude_login-skin-classic-4.0.0/plugins/ude_login/skins/classic ']'
[00:00:55] ++ find roundcubemail-plugin-ude_login-plugin-ude_login-skin-classic-assets-4.0.0 -type f
[00:00:55] find: 'roundcubemail-plugin-ude_login-plugin-ude_login-skin-classic-assets-4.0.0': No such file or directory
[00:00:55] + new_files
[00:00:55] + find /root/rpmbuild/BUILDROOT/roundcubemail-plugin-ude_login-4.0.0-107.tbits20190107.el7.x86_64/usr/share/roundcubemail -type d -exec echo '%dir {}' ';'
[00:00:55] + find /root/rpmbuild/BUILDROOT/roundcubemail-plugin-ude_login-4.0.0-107.tbits20190107.el7.x86_64/usr/share/roundcubemail -type f
[00:00:55] + find /root/rpmbuild/BUILDROOT/roundcubemail-plugin-ude_login-4.0.0-107.tbits20190107.el7.x86_64/usr/share/roundcubemail -type l
[00:00:55] + '[' -f current.files ']'
[00:00:55] + /usr/bin/python ./comm.py current.files current-new.files
[00:00:55] + /usr/bin/mv current-new.files current.files
[00:00:55] + echo '== Files for skin ude_login-classic: =='
[00:00:55] == Files for skin ude_login-classic: ==
[00:00:55] + cat plugin-ude_login-skin-classic-assets.files
[00:00:55] 
[00:00:55] + echo ===========================
[00:00:55] ===========================
[00:00:55] + /usr/bin/mkdir -p /root/rpmbuild/BUILDROOT/roundcubemail-plugin-ude_login-4.0.0-107.tbits20190107.el7.x86_64//var/lib/rpm-state/roundcubemail/
[00:00:55] + /usr/bin/sed -r -i -e 's|/root/rpmbuild/BUILDROOT/roundcubemail-plugin-ude_login-4.0.0-107.tbits20190107.el7.x86_64||g' -e '/^%dir\s*$/d' -e '/^(%dir )*\/etc\/roundcubemail\//d' -e '/^(%dir )*\/var\//d' current.files plugin-ude_login-assets.files plugin-ude_login-skin-classic-assets.files plugin-ude_login-skin-classic.files plugin-ude_login-skin-larry-assets.files plugin-ude_login-skin-larry.files plugin-ude_login.files plugins-assets.files plugins-skins-assets.files plugins-skins.files plugins.files
[00:00:55] + /usr/lib/rpm/find-debuginfo.sh --strict-build-id -m --run-dwz --dwz-low-mem-die-limit 10000000 --dwz-max-die-limit 110000000 /root/rpmbuild/BUILD/roundcubemail-plugin-ude_login-4.0.0
[00:00:55] /usr/lib/rpm/sepdebugcrcfix: Updated 0 CRC32s, 0 CRC32s did match.
[00:00:55] + /usr/lib/rpm/check-buildroot
[00:00:55] + /usr/lib/rpm/redhat/brp-compress
[00:00:55] + /usr/lib/rpm/redhat/brp-strip-static-archive /usr/bin/strip
[00:00:55] + /usr/lib/rpm/brp-python-bytecompile /usr/bin/python 1
[00:00:55] + /usr/lib/rpm/redhat/brp-python-hardlink
[00:00:55] + /usr/lib/rpm/redhat/brp-java-repack-jars
[00:00:55] Processing files: roundcubemail-plugin-ude_login-4.0.0-107.tbits20190107.el7.noarch
[00:00:55] Provides: config(roundcubemail-plugin-ude_login) = 4.0.0-107.tbits20190107.el7 roundcubemail(plugin-ude_login) = 4.0.0-107.tbits20190107.el7 roundcubemail-plugin-ude_login = 4.0.0-107.tbits20190107.el7
[00:00:55] Requires(interp): /bin/sh /bin/sh
[00:00:55] Requires(rpmlib): rpmlib(CompressedFileNames) <= 3.0.4-1 rpmlib(FileDigests) <= 4.6.0-1 rpmlib(PayloadFilesHavePrefix) <= 4.0-1
[00:00:55] Requires(pre): /bin/sh
[00:00:55] Requires(posttrans): /bin/sh
[00:00:55] Processing files: roundcubemail-plugin-ude_login-assets-4.0.0-107.tbits20190107.el7.noarch
[00:00:55] Provides: roundcubemail(plugin-ude_login-assets) = 4.0.0-107.tbits20190107.el7 roundcubemail-plugin-ude_login-assets = 4.0.0-107.tbits20190107.el7
[00:00:55] Requires(rpmlib): rpmlib(CompressedFileNames) <= 3.0.4-1 rpmlib(FileDigests) <= 4.6.0-1 rpmlib(PayloadFilesHavePrefix) <= 4.0-1
[00:00:55] Processing files: roundcubemail-plugin-ude_login-skin-larry-4.0.0-107.tbits20190107.el7.noarch
[00:00:55] Provides: roundcubemail(plugin-ude_login-skin) = 4.0.0-107.tbits20190107.el7 roundcubemail(plugin-ude_login-skin-larry) = 4.0.0-107.tbits20190107.el7 roundcubemail-plugin-ude_login-skin-larry = 4.0.0-107.tbits20190107.el7
[00:00:55] Requires(rpmlib): rpmlib(FileDigests) <= 4.6.0-1 rpmlib(PayloadFilesHavePrefix) <= 4.0-1 rpmlib(CompressedFileNames) <= 3.0.4-1
[00:00:55] Processing files: roundcubemail-plugin-ude_login-skin-larry-assets-4.0.0-107.tbits20190107.el7.noarch
[00:00:55] Provides: roundcubemail(plugin-ude_login-skin-larry-assets) = 4.0.0-107.tbits20190107.el7 roundcubemail-plugin-ude_login-skin-larry-assets = 4.0.0-107.tbits20190107.el7
[00:00:55] Requires(rpmlib): rpmlib(FileDigests) <= 4.6.0-1 rpmlib(PayloadFilesHavePrefix) <= 4.0-1 rpmlib(CompressedFileNames) <= 3.0.4-1
[00:00:55] Checking for unpackaged file(s): /usr/lib/rpm/check-files /root/rpmbuild/BUILDROOT/roundcubemail-plugin-ude_login-4.0.0-107.tbits20190107.el7.x86_64
[00:00:55] Wrote: /root/rpmbuild/SRPMS/roundcubemail-plugin-ude_login-4.0.0-107.tbits20190107.el7.src.rpm
[00:00:55] Wrote: /root/rpmbuild/RPMS/noarch/roundcubemail-plugin-ude_login-4.0.0-107.tbits20190107.el7.noarch.rpm
[00:00:55] Wrote: /root/rpmbuild/RPMS/noarch/roundcubemail-plugin-ude_login-assets-4.0.0-107.tbits20190107.el7.noarch.rpm
[00:00:55] Wrote: /root/rpmbuild/RPMS/noarch/roundcubemail-plugin-ude_login-skin-larry-4.0.0-107.tbits20190107.el7.noarch.rpm
[00:00:55] Wrote: /root/rpmbuild/RPMS/noarch/roundcubemail-plugin-ude_login-skin-larry-assets-4.0.0-107.tbits20190107.el7.noarch.rpm
[00:00:55] Executing(%clean): /bin/sh -e /var/tmp/rpm-tmp.Z1Fylw
[00:00:55] + umask 022
[00:00:55] + cd /root/rpmbuild/BUILD
[00:00:55] + cd roundcubemail-plugin-ude_login-4.0.0
[00:00:55] + rm -rf /root/rpmbuild/BUILDROOT/roundcubemail-plugin-ude_login-4.0.0-107.tbits20190107.el7.x86_64
[00:00:55] + exit 0
[00:00:55] 0
[00:00:55] now running: ssh -f -o "StrictHostKeyChecking no" -o Port=22 -i /etc/lightbuildserver/container/container_rsa root@10.0.3.5 "export LC_ALL=C; (mkdir -p ~/repo/src) 2>&1 && echo \$?"
[00:00:55] 0
[00:00:55] now running: ssh -f -o "StrictHostKeyChecking no" -o Port=22 -i /etc/lightbuildserver/container/container_rsa root@10.0.3.5 "export LC_ALL=C; (cp ~/rpmbuild/SRPMS/*.src.rpm ~/repo/src) 2>&1 && echo \$?"
[00:00:55] 0
[00:00:55] now running: ssh -f -o "StrictHostKeyChecking no" -o Port=22 -i /etc/lightbuildserver/container/container_rsa root@10.0.3.5 "export LC_ALL=C; (cp -R ~/rpmbuild/RPMS/* ~/repo) 2>&1 && echo \$?"
[00:00:55] 0
[00:00:55] now running: ssh -f -o "StrictHostKeyChecking no" -o Port=22 -i /etc/lightbuildserver/container/container_rsa root@10.0.3.5 "export LC_ALL=C; (cd repo && createrepo .) 2>&1 && echo \$?"
[00:00:56] Spawning worker 0 with 87 pkgs
[00:00:56] Spawning worker 1 with 86 pkgs
[00:00:56] Workers Finished
[00:00:56] Saving Primary metadata
[00:00:56] Saving file lists metadata
[00:00:56] Saving other metadata
[00:00:56] Generating sqlite DBs
[00:00:56] Sqlite DBs complete
[00:00:56] 0
[00:00:56] now running: rsync -avz --delete -e "ssh -i /etc/lightbuildserver/container/container_rsa -p 2222" root@build04lxc.lbs.solidcharity.com:/mnt/var/lib/lightbuildserver/repos/tbits.net/TBitsKolab16Test/centos/7 /var/lib/lightbuildserver/repos/tbits.net/TBitsKolab16Test/centos
[00:00:57] receiving incremental file list
[00:00:57] 7/
[00:00:57] deleting 7/repodata/bcab22fd3a1fdcd94e7a3d71eb80144b433bedb937d91ea4ab5b2ea342729395-other.sqlite.bz2
[00:00:57] deleting 7/repodata/b2994bc9e37555d4c054826ad0a605f139daf47c73929ea9a743f455c0220c30-other.xml.gz
[00:00:57] deleting 7/repodata/77f6fd617f952f4c63d37bcf1b5ebc97394347c4dcd79c68bd237acd0a1d3b61-primary.xml.gz
[00:00:57] deleting 7/repodata/4e407df2358159be5c8d67dcc427b5b0cd0d4108cbc4de9c7e913d65e917a854-primary.sqlite.bz2
[00:00:57] deleting 7/repodata/3c45daf5fb0f7b2f5a7971c4dbbc5d5f096a8a1465fee7ed841117826be516e5-filelists.xml.gz
[00:00:57] deleting 7/repodata/2708b87c03cf86040c868f28c6fe21341260f8ff7d3d47c36d26c42d749017c4-filelists.sqlite.bz2
[00:00:57] 7/noarch/
[00:00:57] 7/noarch/roundcubemail-plugin-ude_login-4.0.0-107.tbits20190107.el7.noarch.rpm
[00:00:57] 7/noarch/roundcubemail-plugin-ude_login-assets-4.0.0-107.tbits20190107.el7.noarch.rpm
[00:00:57] 7/noarch/roundcubemail-plugin-ude_login-skin-larry-4.0.0-107.tbits20190107.el7.noarch.rpm
[00:00:57] 7/noarch/roundcubemail-plugin-ude_login-skin-larry-assets-4.0.0-107.tbits20190107.el7.noarch.rpm
[00:00:57] 7/repodata/
[00:00:57] 7/repodata/1f0dced5637a4f72cd0bbafaec546dfcee4fd23d2db534677b0fa7545b50abf5-primary.sqlite.bz2
[00:00:57] 7/repodata/252f9aebd836b061354d1109bc05eefbdbd63af671d787a2efa7e4ac900d4e67-other.xml.gz
[00:00:57] 7/repodata/98e691d2a41b5a7f0278f71a5b4cf9dc58b5db71922af0ce594e7e989fc708cd-primary.xml.gz
[00:00:57] 7/repodata/ba47fb4dc0d784fd6b295729fadfd28dc298395e44d612f483126293469300f4-filelists.xml.gz
[00:00:57] 7/repodata/ca623111598b59a984e34fce70d234239f0463eba533371348a9e6eca1dce1bd-filelists.sqlite.bz2
[00:00:57] 7/repodata/d80dbf1283cf2d21ab7686d1ea1b92345a37c61f006ee2a42a97f3021a37755e-other.sqlite.bz2
[00:00:57] 7/repodata/repomd.xml
[00:00:57] 7/src/
[00:00:57] 7/src/roundcubemail-plugin-ude_login-4.0.0-107.tbits20190107.el7.src.rpm
[00:00:57] 
[00:00:57] sent 307 bytes  received 288,598 bytes  577,810.00 bytes/sec
[00:00:57] total size is 69,762,536  speedup is 241.47
[00:00:57] now running: rsync -avz --delete -e "ssh -i /etc/lightbuildserver/container/container_rsa -p 2222" root@build04lxc.lbs.solidcharity.com:/mnt/var/lib/lightbuildserver/tarballs/tbits.net/TBitsKolab16Test /var/lib/lightbuildserver/tarballs/tbits.net
[00:00:57] receiving incremental file list
[00:00:57] 
[00:00:57] sent 25 bytes  received 68 bytes  186.00 bytes/sec
[00:00:57] total size is 0  speedup is 0.00
[00:00:57] Success!
[00:01:10] This build took about 1 minutes

	
go to top of this page